program: Orca
programVersion: 5.0.2
elementType: O O O O O N C C C C C C C C C C C C C C C C C C C C C H H H H H H H H H H H H H H H H H H H H H H H H H H H
charge: 0
multiplicity: 1
keywords: wb97x-d3
keywords: def2-TZVPP
keywords: def2/J RIJCOSX
keywords: DEFGRID2
keywords: scfconv7
keywords: smallprint printgap noloewdin
keywords: NOSOSCF
formula: C21H27NO5
InChI: InChI=1/C21H27NO5/c1-5-26-20(24)27-18-17(16-12-13(2)6-7-14(16)3)19(23)22-21(18)10-8-15(25-4)9-11-21/h6-7,12,15,22H,5,8-11H2,1-4H3
54 atoms
O  5.84388 0.263819 -0.074449
O  -0.283865 1.036288 0.70682
O  0.085749 -3.341666 -1.055094
O  -1.233668 2.951076 0.696247
O  -0.755875 1.994756 -1.281484
N  1.610836 -1.706694 -0.524205
C  1.633041 -0.349632 -0.032083
C  2.368725 -0.245838 1.313329
C  2.266451 0.615849 -1.044333
C  3.868039 -0.478278 1.158664
C  3.765121 0.379885 -1.190028
C  4.477267 0.493256 0.149194
C  0.156397 -0.120592 0.13593
C  -0.581821 -1.17471 -0.196518
C  0.361833 -2.236802 -0.655723
C  -2.040379 -1.335163 -0.137181
C  6.689481 0.677119 0.960334
C  -2.619817 -2.204339 0.791824
C  -2.842947 -0.604538 -1.008261
C  -0.768776 2.003485 -0.086267
C  -4.228017 -0.70168 -0.980411
C  -4.00656 -2.296099 0.816428
C  -1.78344 -3.01285 1.737775
C  -4.798844 -1.559541 -0.04797
C  -5.07942 0.079025 -1.938903
C  -1.837838 4.076722 0.046661
C  -2.317849 5.020216 1.121902
H  1.941918 -0.966415 2.013867
H  2.196834 0.748275 1.736354
H  2.102541 1.643484 -0.70748
H  1.761074 0.517005 -2.005525
H  4.342646 -0.373438 2.137288
H  4.066648 -1.504754 0.832693
H  3.962193 -0.607173 -1.622058
H  4.18344 1.105105 -1.890807
H  4.327123 1.51976 0.530634
H  2.430262 -2.210736 -0.815361
H  7.715579 0.551503 0.616566
H  6.542219 1.734652 1.21614
H  6.569739 0.09104 1.878912
H  -2.369322 0.045265 -1.733281
H  -4.477161 -2.957207 1.534264
H  -2.396484 -3.462602 2.517924
H  -1.268627 -3.818189 1.212875
H  -1.021838 -2.403516 2.227335
H  -5.877136 -1.656178 0.004631
H  -5.922318 0.551651 -1.433261
H  -4.507747 0.862833 -2.434706
H  -5.490766 -0.565669 -2.717893
H  -2.666493 3.736431 -0.577881
H  -1.109089 4.560975 -0.606998
H  -1.494488 5.3733 1.741745
H  -3.056855 4.547211 1.767233
H  -2.784214 5.889061 0.658495
totalener: -1247.52995891 hartree
nucrepener: 2614.89875996 hartree
electener: -3862.42871887 hartree
oneelecener: -6897.36978436 hartree
twoeener: 3034.94106550 hartree
kineticenergy: 1242.15708902 hartree
xcener: -120.048481690952 hartree
chargesum: -0.0000000
charge: -0.313216 -0.294411 -0.363955 -0.260377 -0.369537 -0.235293 0.490406 -0.263990 -0.260884 -0.201369 -0.195834 0.197291 0.128625 0.045506 0.217660 0.105987 -0.117441 -0.138582 -0.238105 0.469234 -0.007141 -0.063053 -0.255871 -0.139837 -0.234746 0.024555 -0.227925 0.095845 0.091076 0.079378 0.109768 0.078557 0.085539 0.077757 0.083511 0.039831 0.138921 0.112739 0.076419 0.077317 0.142953 0.103236 0.080354 0.121837 0.088418 0.106344 0.087669 0.080875 0.102636 0.094049 0.092457 0.085254 0.090212 0.079356
qa: -0.3132 -0.2944 -0.3640 -0.2604 -0.3695 -0.2353 0.4904 -0.2640 -0.2609 -0.2014 -0.1958 0.1973 0.1286 0.0455 0.2177 0.1060 -0.1174 -0.1386 -0.2381 0.4692 -0.0071 -0.0631 -0.2559 -0.1398 -0.2347 0.0246 -0.2279 0.0958 0.0911 0.0794 0.1098 0.0786 0.0855 0.0778 0.0835 0.0398 0.1389 0.1127 0.0764 0.0773 0.1430 0.1032 0.0804 0.1218 0.0884 0.1063 0.0877 0.0809 0.1026 0.0940 0.0925 0.0853 0.0902 0.0794
va: 2.0292 2.1246 2.1730 2.1542 2.1141 3.2000 3.6243 3.9987 3.9762 3.7924 3.8885 3.8426 3.8632 3.3514 4.3930 3.3783 3.9487 3.9491 3.9424 4.3963 3.8205 3.8993 3.9147 4.0055 3.9235 3.8804 3.9600 1.0187 1.0179 1.0171 1.0238 1.0208 1.0253 1.0288 1.0274 1.0088 1.0417 0.9951 0.9912 0.9817 1.0161 1.0090 1.0090 1.0038 0.9959 1.0053 0.9984 1.0081 0.9930 0.9958 0.9969 1.0056 1.0054 1.0079
dispcorr: -0.028771336 hartree
energy: -1247.558730243195
dipole: 7.22486 -6.87428 0.35058 12.19211 -10.12948 2.06263 6.12040 -5.02228 1.09812
magnitude: 2.36288 au
magnitude: 6.00597 debye
