program: Orca
programVersion: 5.0.2
elementType: Cl O O O O O N N C C C C C C C C C C C C C C C C C C C C C H H H H H H H H H H H H H H H H H H H H H H H H H H H
charge: 0
multiplicity: 1
keywords: wb97x-d3
keywords: def2-TZVPP
keywords: def2/J RIJCOSX
keywords: DEFGRID2
keywords: scfconv7
keywords: smallprint printgap noloewdin
keywords: NOSOSCF
formula: C21H27ClN2O5
InChI: InChI=1/C21H27ClN2O5/c1-6-28-20(26)29-18-17(16-13(2)11-15(22)12-14(16)3)19(25)23(4)21(18)7-9-24(27-5)10-8-21/h11-12H,6-10H2,1-5H3
56 atoms
Cl 6.042639 0.194223 0.725233
O  -0.715518 -1.172486 0.665866
O  -5.46741 -0.444571 -0.089015
O  0.072057 3.367726 -0.368497
O  0.637149 -1.794271 -0.962856
O  0.629503 -2.885235 1.00119
N  -1.816138 2.061802 -0.303245
N  -4.393394 -1.307364 0.238921
C  -2.176367 0.681985 -0.004552
C  -3.107763 0.607737 1.218617
C  -2.840499 0.011262 -1.222089
C  -0.81094 0.112159 0.258374
C  -3.740184 -0.768011 1.420524
C  -3.485957 -1.334364 -0.896633
C  0.165147 1.008189 0.119848
C  -0.48621 2.29167 -0.218234
C  -2.787022 3.10112 -0.522533
C  1.614316 0.838057 0.2867
C  2.452419 0.974925 -0.830732
C  2.148197 0.524771 1.543978
C  0.259512 -2.016596 0.267329
C  -6.682165 -1.15279 -0.006825
C  3.818767 0.770633 -0.684563
C  3.521241 0.327403 1.667097
C  1.912927 1.34801 -2.179351
C  1.289882 0.407637 2.770274
C  4.335461 0.446386 0.55766
C  1.70129 -2.62792 -1.478146
C  1.878295 -2.31465 -2.938823
H  -3.905954 1.340218 1.080277
H  -2.566671 0.904125 2.120249
H  -2.109916 -0.111762 -2.025237
H  -3.610982 0.684722 -1.603522
H  -2.996965 -1.502865 1.733183
H  -4.470504 -0.71659 2.230181
H  -4.030367 -1.697111 -1.770352
H  -2.731456 -2.092147 -0.678004
H  -2.290392 3.970837 -0.945511
H  -3.280142 3.409043 0.40158
H  -3.551453 2.779763 -1.229322
H  -6.727319 -1.9876 -0.713151
H  -7.472798 -0.444797 -0.25949
H  -6.873238 -1.537932 0.999736
H  4.472394 0.86545 -1.542236
H  3.944224 0.087825 2.634256
H  0.961146 0.862163 -2.395588
H  2.613472 1.080095 -2.969069
H  1.749203 2.424487 -2.248326
H  1.884134 0.559588 3.670501
H  0.834242 -0.580621 2.856206
H  0.483447 1.140519 2.776771
H  2.611848 -2.423051 -0.912396
H  1.433947 -3.675849 -1.336791
H  2.647502 -2.973702 -3.341678
H  0.962237 -2.491205 -3.50283
H  2.20201 -1.288302 -3.104897
elementType: Cl O N C H
totalener: -1762.46336278 hartree
nucrepener: 3252.56209259 hartree
electener: -5015.02545537 hartree
oneelecener: -8880.78321074 hartree
twoeener: 3865.75775537 hartree
cpcmener: -0.03830218 hartree
kineticenergy: 1756.15963662 hartree
xcener: -145.905091828790 hartree
chargesum: 0.0000000
charge: -0.098174 -0.309387 -0.334498 -0.521702 -0.251142 -0.414992 -0.122731 -0.044013 0.478424 -0.196408 -0.215258 0.011668 -0.131624 -0.125525 0.132644 0.276950 -0.174339 0.030100 -0.203414 -0.135329 0.495097 -0.095925 -0.122878 -0.119363 -0.286939 -0.237904 0.114170 0.015564 -0.266153 0.100549 0.099876 0.095841 0.102399 0.107404 0.097127 0.096806 0.105454 0.105609 0.110886 0.113934 0.089970 0.107641 0.089904 0.121305 0.120330 0.105632 0.107739 0.124006 0.106711 0.102580 0.107301 0.116280 0.122362 0.099680 0.093122 0.102634
qa: -0.0982 -0.3094 -0.3345 -0.5217 -0.2511 -0.4150 -0.1227 -0.0440 0.4784 -0.1964 -0.2153 0.0117 -0.1316 -0.1255 0.1326 0.2769 -0.1743 0.0301 -0.2034 -0.1353 0.4951 -0.0959 -0.1229 -0.1194 -0.2869 -0.2379 0.1142 0.0156 -0.2662 0.1005 0.0999 0.0958 0.1024 0.1074 0.0971 0.0968 0.1055 0.1056 0.1109 0.1139 0.0900 0.1076 0.0899 0.1213 0.1203 0.1056 0.1077 0.1240 0.1067 0.1026 0.1073 0.1163 0.1224 0.0997 0.0931 0.1026
va: 1.2069 2.1032 1.9097 2.0118 2.1254 2.0964 3.2114 2.7352 3.5442 3.8624 3.8752 4.0740 4.0168 4.0166 2.9346 4.2662 3.8987 3.0001 3.8559 3.8631 4.3888 3.9308 3.9651 3.9862 3.9087 3.9143 3.8187 3.8029 3.9573 1.0174 1.0189 1.0244 1.0189 1.0162 1.0052 1.0055 1.0130 1.0194 0.9862 0.9915 0.9920 0.9972 0.9910 1.0190 1.0199 0.9947 0.9976 1.0116 1.0042 1.0051 1.0002 0.9912 1.0006 1.0071 1.0047 0.9957
dispcorr: -0.037480228 hartree
energy: -1762.500843005581
dipole: -36.61504 34.51487 -2.10017 -3.84724 2.57640 -1.27084 -10.88529 9.63973 -1.24556
magnitude: 2.75267 au
magnitude: 6.99673 debye
