program: Orca
programVersion: 5.0.2
elementType: Cl O O O O O N N C C C C C C C C C C C C C C C C C C C C C H H H H H H H H H H H H H H H H H H H H H H H H H H H
charge: 0
multiplicity: 1
keywords: wb97x-d3
keywords: def2-TZVPP
keywords: def2/J RIJCOSX
keywords: DEFGRID2
keywords: scfconv7
keywords: smallprint printgap noloewdin
keywords: NOSOSCF
formula: C21H27ClN2O5
InChI: InChI=1/C21H27ClN2O5/c1-6-28-20(26)29-18-17(16-13(2)11-15(22)12-14(16)3)19(25)23(4)21(18)7-9-24(27-5)10-8-21/h11-12H,6-10H2,1-5H3
56 atoms
Cl 6.138837 0.521637 0.29468
O  -0.481936 -1.330064 0.304676
O  -6.255119 -0.475664 -0.005075
O  -0.094601 3.361166 0.013198
O  0.773015 -3.045519 0.085564
O  0.707962 -1.552615 -1.599187
N  -1.887353 1.922755 -0.016973
N  -4.848533 -0.568339 0.055339
C  -2.124641 0.486785 0.080571
C  -2.900241 0.080601 1.348625
C  -2.803579 -0.112788 -1.167001
C  -0.706514 -0.004116 0.150658
C  -4.412962 0.191542 1.213205
C  -4.321092 0.005011 -1.169174
C  0.194316 0.971774 0.099605
C  -0.568662 2.235908 0.019899
C  -2.907923 2.938457 0.049931
C  1.659627 0.885672 0.15962
C  2.420063 1.238195 -0.964752
C  2.284128 0.431703 1.329133
C  0.394585 -1.949969 -0.515519
C  -6.819417 -1.765302 0.067633
C  3.80392 1.120796 -0.912739
C  3.671715 0.326048 1.360342
C  1.776203 1.735073 -2.223833
C  1.503348 0.058648 2.55499
C  4.411647 0.666049 0.244139
C  1.776666 -3.85306 -0.566185
C  3.158467 -3.267202 -0.398532
H  -2.556771 0.676715 2.196209
H  -2.665416 -0.961043 1.577583
H  -2.557815 -1.176153 -1.214362
H  -2.393199 0.350575 -2.065521
H  -4.866642 -0.239835 2.107488
H  -4.738929 1.238281 1.157346
H  -4.644069 1.045612 -1.305411
H  -4.705307 -0.564336 -2.017774
H  -3.389948 2.973167 1.028045
H  -3.670851 2.792506 -0.712052
H  -2.447307 3.907113 -0.127671
H  -7.901402 -1.634626 0.020327
H  -6.574427 -2.275622 1.004238
H  -6.512299 -2.402677 -0.76738
H  4.399173 1.381908 -1.778334
H  4.164434 -0.018609 2.260493
H  1.499945 2.78681 -2.134889
H  0.869348 1.182054 -2.46913
H  2.457026 1.650421 -3.069692
H  2.13956 0.081669 3.438963
H  1.097629 -0.952109 2.479934
H  0.665901 0.73384 2.729573
H  1.700182 -4.818552 -0.070803
H  1.518044 -3.991266 -1.616808
H  3.278516 -2.323067 -0.929279
H  3.400334 -3.11259 0.653215
H  3.887559 -3.968249 -0.806662
elementType: Cl O N C H
totalener: -1762.46506630 hartree
nucrepener: 3195.86086428 hartree
electener: -4958.32593058 hartree
oneelecener: -8768.09352962 hartree
twoeener: 3809.76759905 hartree
cpcmener: -0.03836294 hartree
kineticenergy: 1756.16457379 hartree
xcener: -145.902546949367 hartree
chargesum: -0.0000000
charge: -0.098432 -0.332437 -0.347625 -0.518519 -0.282579 -0.419665 -0.089273 -0.037730 0.446445 -0.250133 -0.244143 0.093404 -0.124376 -0.129173 0.096004 0.278736 -0.197890 -0.001795 -0.134485 -0.113759 0.542076 -0.083468 -0.129528 -0.158134 -0.247192 -0.243919 0.124328 0.042691 -0.257030 0.101871 0.097343 0.095729 0.099281 0.096723 0.111928 0.113898 0.095975 0.113749 0.119857 0.111519 0.111797 0.089326 0.089212 0.119514 0.118856 0.111807 0.100262 0.102618 0.105337 0.103615 0.108225 0.113926 0.101903 0.085467 0.091658 0.106204
qa: -0.0984 -0.3324 -0.3476 -0.5185 -0.2826 -0.4197 -0.0893 -0.0377 0.4464 -0.2501 -0.2441 0.0934 -0.1244 -0.1292 0.0960 0.2787 -0.1979 -0.0018 -0.1345 -0.1138 0.5421 -0.0835 -0.1295 -0.1581 -0.2472 -0.2439 0.1243 0.0427 -0.2570 0.1019 0.0973 0.0957 0.0993 0.0967 0.1119 0.1139 0.0960 0.1137 0.1199 0.1115 0.1118 0.0893 0.0892 0.1195 0.1189 0.1118 0.1003 0.1026 0.1053 0.1036 0.1082 0.1139 0.1019 0.0855 0.0917 0.1062
va: 1.2062 2.0987 1.8770 2.0148 2.1489 2.0770 3.2212 2.7531 3.5900 3.9411 3.9641 3.9753 3.9288 3.9495 3.0272 4.2577 3.8756 3.0362 3.8734 3.8259 4.3413 3.9244 3.9834 3.9677 3.9064 3.9148 3.7922 3.8471 3.9152 1.0164 1.0272 1.0254 1.0223 1.0118 1.0057 1.0027 1.0105 0.9874 0.9894 1.0291 0.9961 0.9914 0.9911 1.0200 1.0215 1.0072 1.0059 1.0044 1.0041 1.0035 0.9988 0.9962 1.0058 1.0097 1.0029 1.0094
dispcorr: -0.035925908 hartree
energy: -1762.500992207344
dipole: -35.29595 33.51058 -1.78536 -8.48132 5.91472 -2.56661 -0.84559 1.26834 0.42274
magnitude: 3.15495 au
magnitude: 8.01924 debye
