program: Orca
programVersion: 5.0.2
elementType: Cl O O O O O N N C C C C C C C C C C C C C C C C C C C C C H H H H H H H H H H H H H H H H H H H H H H H H H H H
charge: 0
multiplicity: 1
keywords: wb97x-d3
keywords: def2-TZVPP
keywords: def2/J RIJCOSX
keywords: DEFGRID2
keywords: scfconv7
keywords: smallprint printgap noloewdin
keywords: NOSOSCF
formula: C21H27ClN2O5
InChI: InChI=1/C21H27ClN2O5/c1-6-28-20(26)29-18-17(16-13(2)11-15(22)12-14(16)3)19(25)23(4)21(18)7-9-24(27-5)10-8-21/h11-12H,6-10H2,1-5H3
56 atoms
Cl 6.124931 0.512479 0.521756
O  -0.600932 -0.959243 0.368859
O  -4.904258 -2.218671 0.092384
O  0.110921 3.684042 -0.082289
O  0.416115 -2.82186 0.17996
O  0.586522 -1.341822 -1.510558
N  -1.768971 2.366446 -0.136764
N  -4.340191 -0.930085 0.005279
C  -2.116739 0.956914 -0.009606
C  -3.026191 0.718621 1.206688
C  -2.813605 0.448787 -1.285238
C  -0.743434 0.368803 0.148934
C  -3.629767 -0.677045 1.24734
C  -3.441142 -0.928936 -1.134856
C  0.22447 1.280448 0.10168
C  -0.438642 2.593643 -0.055187
C  -2.746007 3.423048 -0.174144
C  1.677913 1.099055 0.214713
C  2.491298 1.354461 -0.898322
C  2.238722 0.66293 1.422713
C  0.194751 -1.691676 -0.43536
C  -6.310236 -2.124848 0.070248
C  3.864823 1.168336 -0.793157
C  3.61641 0.484585 1.505816
C  1.919477 1.823606 -2.202779
C  1.399754 0.383742 2.63478
C  4.409466 0.737819 0.402884
C  1.187662 -3.826719 -0.512198
C  0.358995 -4.577137 -1.524924
H  -3.845927 1.439892 1.159989
H  -2.480967 0.915158 2.13189
H  -2.11137 0.445497 -2.121207
H  -3.60724 1.155675 -1.538115
H  -2.868083 -1.440965 1.449746
H  -4.346259 -0.713729 2.070529
H  -4.021079 -1.1386 -2.035817
H  -2.678236 -1.715642 -1.058818
H  -3.147297 3.650638 0.814923
H  -3.574329 3.162316 -0.830547
H  -2.284528 4.324759 -0.568445
H  -6.691233 -3.144908 0.136003
H  -6.683283 -1.674666 -0.854671
H  -6.703816 -1.556295 0.91876
H  4.50065 1.355905 -1.648845
H  4.059965 0.152393 2.43561
H  0.964709 1.350636 -2.429663
H  2.600474 1.608093 -3.024766
H  1.754277 2.901903 -2.194887
H  0.6277 1.139005 2.781794
H  2.015296 0.359078 3.533185
H  0.899916 -0.583949 2.563354
H  2.067758 -3.36831 -0.964638
H  1.525514 -4.490338 0.281063
H  -0.514134 -5.037696 -1.062415
H  0.027148 -3.942399 -2.345961
H  0.968186 -5.375072 -1.951296
elementType: Cl O N C H
totalener: -1762.46738658 hartree
nucrepener: 3207.68283390 hartree
electener: -4970.15022047 hartree
oneelecener: -8791.88281226 hartree
twoeener: 3821.73259179 hartree
cpcmener: -0.03918934 hartree
kineticenergy: 1756.18043528 hartree
xcener: -145.905027459780 hartree
chargesum: -0.0000000
charge: -0.099136 -0.328240 -0.348461 -0.520164 -0.290175 -0.428572 -0.123263 -0.046211 0.492028 -0.195298 -0.234436 0.015056 -0.130068 -0.121828 0.113797 0.278418 -0.177721 -0.001813 -0.139350 -0.128270 0.557032 -0.083501 -0.127317 -0.125302 -0.252496 -0.243347 0.112679 0.041066 -0.255823 0.101289 0.098362 0.097865 0.103742 0.104047 0.095310 0.095994 0.103350 0.113700 0.115230 0.105976 0.111809 0.089681 0.088189 0.120287 0.119788 0.099671 0.104661 0.111902 0.107514 0.103598 0.103880 0.099051 0.113999 0.090589 0.091911 0.099326
qa: -0.0991 -0.3282 -0.3485 -0.5202 -0.2902 -0.4286 -0.1233 -0.0462 0.4920 -0.1953 -0.2344 0.0151 -0.1301 -0.1218 0.1138 0.2784 -0.1777 -0.0018 -0.1394 -0.1283 0.5570 -0.0835 -0.1273 -0.1253 -0.2525 -0.2433 0.1127 0.0411 -0.2558 0.1013 0.0984 0.0979 0.1037 0.1040 0.0953 0.0960 0.1033 0.1137 0.1152 0.1060 0.1118 0.0897 0.0882 0.1203 0.1198 0.0997 0.1047 0.1119 0.1075 0.1036 0.1039 0.0991 0.1140 0.0906 0.0919 0.0993
va: 1.2066 2.0923 1.8750 2.0131 2.1376 2.0703 3.2075 2.7611 3.5359 3.9658 3.9668 4.0749 3.9421 3.9452 3.0463 4.2626 3.9000 3.0524 3.8685 3.8729 4.3037 3.9261 3.9892 3.9791 3.9119 3.9192 3.8243 3.8487 3.9209 1.0106 1.0167 1.0230 1.0149 1.0210 1.0072 1.0086 1.0113 0.9847 0.9926 1.0176 0.9960 0.9929 0.9895 1.0190 1.0205 1.0052 1.0035 1.0059 0.9979 1.0048 1.0025 1.0063 0.9954 1.0045 1.0121 1.0071
dispcorr: -0.034725703 hartree
energy: -1762.502112278679
dipole: -40.20713 37.62678 -2.58036 -11.10067 8.99371 -2.10696 -4.58303 4.81428 0.23125
magnitude: 3.33931 au
magnitude: 8.48786 debye
