program: Orca
programVersion: 5.0.2
elementType: Cl O O O O O N N C C C C C C C C C C C C C C C C C C C C C H H H H H H H H H H H H H H H H H H H H H H H H H H H
charge: 0
multiplicity: 1
keywords: wb97x-d3
keywords: def2-TZVPP
keywords: def2/J RIJCOSX
keywords: DEFGRID2
keywords: scfconv7
keywords: smallprint printgap noloewdin
keywords: NOSOSCF
formula: C21H27ClN2O5
InChI: InChI=1/C21H27ClN2O5/c1-6-28-20(26)29-18-17(16-13(2)11-15(22)12-14(16)3)19(25)23(4)21(18)7-9-24(27-5)10-8-21/h11-12H,6-10H2,1-5H3
56 atoms
Cl 6.061947 0.258035 0.74384
O  -0.712546 -1.172963 0.681889
O  -5.458459 -0.441615 -0.120693
O  0.080391 3.373959 -0.320021
O  0.64111 -1.786228 -0.950534
O  0.539653 -2.960464 0.962382
N  -1.803339 2.062425 -0.295637
N  -4.388308 -1.304757 0.215175
C  -2.165184 0.681873 -0.002404
C  -3.109051 0.606226 1.210824
C  -2.818741 0.014661 -1.227722
C  -0.801449 0.111498 0.27089
C  -3.744976 -0.769139 1.404146
C  -3.470644 -1.330324 -0.912132
C  0.175262 1.008137 0.140275
C  -0.476109 2.294057 -0.191216
C  -2.772868 3.10746 -0.495608
C  1.625445 0.845922 0.307317
C  2.461211 0.994889 -0.810157
C  2.163541 0.53739 1.563644
C  0.225901 -2.044449 0.260046
C  -6.675359 -1.145546 -0.036273
C  3.830024 0.805944 -0.664938
C  3.538927 0.357307 1.686503
C  1.917355 1.363705 -2.158346
C  1.30519 0.40438 2.787952
C  4.351067 0.48623 0.57653
C  1.669863 -2.653589 -1.483704
C  1.923583 -2.257959 -2.912798
H  -3.905511 1.339128 1.064694
H  -2.577857 0.901533 2.118575
H  -2.080878 -0.108247 -2.024147
H  -3.583775 0.691075 -1.615141
H  -3.005931 -1.505903 1.72199
H  -4.48282 -0.71828 2.206968
H  -4.008088 -1.688746 -1.791935
H  -2.720134 -2.090907 -0.689352
H  -3.588477 2.76067 -1.128811
H  -2.299361 3.947925 -0.997944
H  -3.196083 3.467183 0.44473
H  -6.721645 -1.985175 -0.736886
H  -7.463582 -0.437078 -0.295131
H  -6.869931 -1.523447 0.972496
H  4.481944 0.90918 -1.522946
H  3.965331 0.123916 2.653724
H  1.730155 2.436708 -2.222579
H  0.977177 0.858149 -2.380636
H  2.625914 1.115334 -2.947459
H  1.898216 0.545495 3.690748
H  0.850154 -0.585374 2.85948
H  0.497988 1.136429 2.80315
H  2.569362 -2.546178 -0.8751
H  1.330286 -3.688296 -1.421366
H  2.667742 -2.936104 -3.330934
H  1.022853 -2.338399 -3.521409
H  2.316509 -1.246007 -2.995626
elementType: Cl O N C H
totalener: -1762.46370653 hartree
nucrepener: 3249.89226681 hartree
electener: -5012.35597335 hartree
oneelecener: -8875.40145303 hartree
twoeener: 3863.04547968 hartree
cpcmener: -0.03878752 hartree
kineticenergy: 1756.15710465 hartree
xcener: -145.904384009580 hartree
chargesum: -0.0000000
charge: -0.098315 -0.309864 -0.334374 -0.522031 -0.251446 -0.420094 -0.127449 -0.043897 0.479294 -0.194992 -0.217298 0.016376 -0.131291 -0.125297 0.136399 0.277711 -0.179174 0.025709 -0.208280 -0.130844 0.504128 -0.095688 -0.122215 -0.121134 -0.284975 -0.239771 0.114522 0.015502 -0.268001 0.100300 0.099620 0.095195 0.102672 0.107201 0.097176 0.096808 0.105569 0.116026 0.105560 0.112937 0.089962 0.107606 0.089703 0.121370 0.120351 0.123838 0.105858 0.108027 0.105990 0.103484 0.107228 0.116496 0.121278 0.100909 0.094294 0.101333
qa: -0.0983 -0.3099 -0.3344 -0.5220 -0.2514 -0.4201 -0.1274 -0.0439 0.4793 -0.1950 -0.2173 0.0164 -0.1313 -0.1253 0.1364 0.2777 -0.1792 0.0257 -0.2083 -0.1308 0.5041 -0.0957 -0.1222 -0.1211 -0.2850 -0.2398 0.1145 0.0155 -0.2680 0.1003 0.0996 0.0952 0.1027 0.1072 0.0972 0.0968 0.1056 0.1160 0.1056 0.1129 0.0900 0.1076 0.0897 0.1214 0.1204 0.1238 0.1059 0.1080 0.1060 0.1035 0.1072 0.1165 0.1213 0.1009 0.0943 0.1013
va: 1.2070 2.1056 1.9098 2.0110 2.1253 2.0929 3.2063 2.7348 3.5463 3.8621 3.8758 4.0693 4.0151 4.0180 2.9284 4.2627 3.9024 2.9909 3.8551 3.8635 4.3772 3.9307 3.9661 3.9847 3.9072 3.9162 3.8194 3.8024 3.9588 1.0170 1.0189 1.0249 1.0185 1.0167 1.0051 1.0057 1.0123 0.9920 1.0163 0.9850 0.9923 0.9972 0.9908 1.0191 1.0200 1.0118 0.9948 0.9975 1.0043 1.0039 0.9998 0.9927 0.9999 1.0074 1.0045 0.9953
dispcorr: -0.037384511 hartree
energy: -1762.501091043800
dipole: -36.53497 34.44927 -2.08570 -3.91606 2.67229 -1.24377 -10.96618 9.70819 -1.25799
magnitude: 2.73490 au
magnitude: 6.95156 debye
