program: Orca
programVersion: 5.0.2
elementType: Cl O O O O O N N C C C C C C C C C C C C C C C C C C C C C H H H H H H H H H H H H H H H H H H H H H H H H H H H
charge: 0
multiplicity: 1
keywords: wb97x-d3
keywords: def2-TZVPP
keywords: def2/J RIJCOSX
keywords: DEFGRID2
keywords: scfconv7
keywords: smallprint printgap noloewdin
keywords: NOSOSCF
formula: C21H27ClN2O5
InChI: InChI=1/C21H27ClN2O5/c1-6-28-20(26)29-18-17(16-13(2)11-15(22)12-14(16)3)19(25)23(4)21(18)7-9-24(27-5)10-8-21/h11-12H,6-10H2,1-5H3
56 atoms
Cl 6.006478 0.164191 -0.47299
O  -0.767986 -0.996238 -0.900194
O  -5.514488 -0.381789 -0.174194
O  0.039455 3.106419 1.309923
O  0.644408 -2.006918 0.459616
O  0.626454 -2.496614 -1.735864
N  -1.857121 1.90211 0.828945
N  -4.440184 -1.153398 -0.667972
C  -2.216569 0.657344 0.171531
C  -2.9452 -0.290026 1.143652
C  -3.094812 0.91623 -1.066452
C  -0.845525 0.147273 -0.185277
C  -3.589643 -1.494569 0.457091
C  -3.726528 -0.350223 -1.64454
C  0.133947 0.965202 0.19954
C  -0.51191 2.130263 0.854193
C  -2.813619 2.859692 1.308824
C  1.584606 0.818232 0.023326
C  2.144498 0.799551 -1.259445
C  2.40153 0.670849 1.155126
C  0.249654 -1.885545 -0.787547
C  -6.722463 -1.033672 -0.471118
C  3.514554 0.594245 -1.400784
C  3.763941 0.470838 0.988747
C  1.31975 1.006386 -2.498272
C  1.832148 0.726199 2.541638
C  4.307502 0.426127 -0.284081
C  1.806491 -2.826589 0.681879
C  1.992568 -2.983248 2.169206
H  -3.73191 0.276486 1.646139
H  -2.254668 -0.622825 1.922387
H  -2.511064 1.432418 -1.83276
H  -3.898564 1.595369 -0.774325
H  -2.835605 -2.187998 0.081866
H  -4.182565 -2.055661 1.18167
H  -4.420365 -0.082113 -2.443349
H  -2.975189 -0.997602 -2.098111
H  -2.283078 3.613366 1.884665
H  -3.554134 2.391881 1.958497
H  -3.341958 3.364767 0.497247
H  -6.788046 -2.020059 -0.001776
H  -6.87502 -1.155091 -1.54793
H  -7.519417 -0.404037 -0.074525
H  3.957909 0.574554 -2.387566
H  4.403624 0.3524 1.853579
H  1.924099 1.448902 -3.289113
H  0.475008 1.669619 -2.318718
H  0.926926 0.065249 -2.886242
H  0.916445 0.139895 2.625988
H  1.588636 1.752114 2.816245
H  2.544184 0.34653 3.273772
H  1.666782 -3.794841 0.19851
H  2.66901 -2.338019 0.223801
H  2.86411 -3.610472 2.353874
H  2.162927 -2.02581 2.657419
H  1.132049 -3.463527 2.633949
totalener: -1762.43382968 hartree
nucrepener: 3260.43931512 hartree
electener: -5022.87314480 hartree
oneelecener: -8896.30038121 hartree
twoeener: 3873.42723641 hartree
kineticenergy: 1756.23151425 hartree
xcener: -145.912796161372 hartree
chargesum: -0.0000000
charge: -0.080294 -0.306000 -0.298697 -0.395327 -0.250482 -0.313500 -0.122080 -0.017494 0.448235 -0.219143 -0.211970 0.016483 -0.129929 -0.131723 0.052117 0.246105 -0.176167 0.079073 -0.105662 -0.173276 0.407263 -0.090384 -0.099285 -0.116575 -0.231182 -0.290946 0.093227 0.000354 -0.246316 0.101383 0.089279 0.093616 0.100215 0.099929 0.082884 0.082153 0.108990 0.116748 0.098880 0.092494 0.082012 0.082019 0.099213 0.098237 0.098626 0.097821 0.094475 0.109551 0.095167 0.143720 0.086510 0.119914 0.115002 0.090533 0.095757 0.088446
qa: -0.0803 -0.3060 -0.2987 -0.3953 -0.2505 -0.3135 -0.1221 -0.0175 0.4482 -0.2191 -0.2120 0.0165 -0.1299 -0.1317 0.0521 0.2461 -0.1762 0.0791 -0.1057 -0.1733 0.4073 -0.0904 -0.0993 -0.1166 -0.2312 -0.2909 0.0932 0.0004 -0.2463 0.1014 0.0893 0.0936 0.1002 0.0999 0.0829 0.0822 0.1090 0.1167 0.0989 0.0925 0.0820 0.0820 0.0992 0.0982 0.0986 0.0978 0.0945 0.1096 0.0952 0.1437 0.0865 0.1199 0.1150 0.0905 0.0958 0.0884
va: 1.2246 2.1021 1.9381 2.1424 2.1104 2.1907 3.1857 2.7804 3.5846 3.8750 3.8715 4.0148 4.0508 4.0414 2.9728 4.2848 3.9061 3.0632 3.8524 3.8439 4.4603 3.9515 4.0137 3.9572 3.9091 3.8941 3.9081 3.8258 3.9417 1.0189 1.0240 1.0186 1.0176 1.0131 1.0076 1.0078 1.0166 1.0229 0.9912 0.9899 0.9941 0.9938 0.9981 1.0257 1.0264 1.0068 1.0055 1.0037 0.9925 1.0115 1.0015 1.0050 0.9891 1.0097 1.0001 1.0067
dispcorr: -0.037870159 hartree
energy: -1762.471699837987
dipole: -36.14609 34.68725 -1.45884 -5.29850 4.34267 -0.95583 8.14352 -7.59280 0.55072
magnitude: 1.82897 au
magnitude: 4.64886 debye
