program: Orca
programVersion: 5.0.2
elementType: Cl O O O O O N N C C C C C C C C C C C C C C C C C C C C C H H H H H H H H H H H H H H H H H H H H H H H H H H H
charge: 0
multiplicity: 1
keywords: wb97x-d3
keywords: def2-TZVPP
keywords: def2/J RIJCOSX
keywords: DEFGRID2
keywords: scfconv7
keywords: smallprint printgap noloewdin
keywords: NOSOSCF
formula: C21H27ClN2O5
InChI: InChI=1/C21H27ClN2O5/c1-6-28-20(26)29-18-17(16-13(2)11-15(22)12-14(16)3)19(25)23(4)21(18)7-9-24(27-5)10-8-21/h11-12H,6-10H2,1-5H3
56 atoms
Cl 6.075944 0.546509 0.497441
O  -0.53584 -1.103017 0.351743
O  -5.387252 -0.550771 -0.007593
O  -0.086461 3.57741 -0.087335
O  0.723671 -2.824332 0.17929
O  0.638868 -1.390598 -1.555498
N  -1.896181 2.160617 -0.086438
N  -4.259424 -1.389327 0.130061
C  -2.165762 0.737604 0.038216
C  -3.012933 0.441427 1.289134
C  -2.867863 0.196092 -1.221727
C  -0.757475 0.222684 0.155657
C  -3.551855 -0.988043 1.332615
C  -3.431851 -1.214492 -1.049621
C  0.160932 1.182613 0.110268
C  -0.567029 2.468595 -0.036964
C  -2.919491 3.166062 -0.138614
C  1.620162 1.05406 0.216797
C  2.421687 1.327192 -0.899018
C  2.196552 0.641242 1.423064
C  0.333455 -1.746298 -0.459539
C  -6.550065 -1.338662 0.002175
C  3.796659 1.165625 -0.80046
C  3.576918 0.489222 1.499115
C  1.81962 1.785666 -2.192164
C  1.366051 0.370274 2.645055
C  4.360389 0.746459 0.391028
C  1.672625 -3.670028 -0.487347
C  1.014333 -4.602806 -1.478395
H  -3.862655 1.127466 1.29918
H  -2.429331 0.652888 2.18868
H  -2.17749 0.225276 -2.067853
H  -3.695029 0.865442 -1.466924
H  -2.747157 -1.710205 1.48033
H  -4.224817 -1.101966 2.184424
H  -4.020884 -1.483166 -1.928394
H  -2.63519 -1.957577 -0.984454
H  -3.671401 2.928821 -0.892303
H  -2.456022 4.112476 -0.40518
H  -3.426692 3.296568 0.820316
H  -6.573338 -2.054839 -0.824856
H  -7.389898 -0.65198 -0.106845
H  -6.668657 -1.891888 0.93892
H  4.427257 1.365942 -1.6564
H  4.037529 0.177798 2.427259
H  0.985116 1.150477 -2.488166
H  2.55432 1.764896 -2.995672
H  1.449314 2.807232 -2.104362
H  1.988011 0.351946 3.538843
H  0.858292 -0.593581 2.584478
H  0.602291 1.133946 2.790555
H  2.440073 -3.059706 -0.965689
H  2.140591 -4.230737 0.319955
H  0.233331 -5.197463 -1.005124
H  0.584922 -4.062511 -2.320224
H  1.761858 -5.290982 -1.873627
totalener: -1762.43658117 hartree
nucrepener: 3221.05743281 hartree
electener: -4983.49401398 hartree
oneelecener: -8818.12234003 hartree
twoeener: 3834.62832605 hartree
kineticenergy: 1756.23937108 hartree
xcener: -145.910797995151 hartree
chargesum: -0.0000000
charge: -0.085567 -0.328711 -0.298698 -0.389165 -0.268123 -0.353211 -0.121325 -0.017954 0.457765 -0.206066 -0.228725 0.014126 -0.136135 -0.130557 0.031662 0.238783 -0.176025 0.052182 -0.094817 -0.115902 0.484387 -0.090758 -0.105455 -0.111132 -0.242369 -0.238909 0.097237 0.030606 -0.255506 0.101118 0.091738 0.097994 0.101289 0.104381 0.082804 0.083353 0.098586 0.099162 0.117025 0.091890 0.081541 0.099620 0.081789 0.096034 0.095901 0.099539 0.077837 0.122347 0.090458 0.097878 0.100207 0.098677 0.102696 0.087030 0.099385 0.088083
qa: -0.0856 -0.3287 -0.2987 -0.3892 -0.2681 -0.3532 -0.1213 -0.0180 0.4578 -0.2061 -0.2287 0.0141 -0.1361 -0.1306 0.0317 0.2388 -0.1760 0.0522 -0.0948 -0.1159 0.4844 -0.0908 -0.1055 -0.1111 -0.2424 -0.2389 0.0972 0.0306 -0.2555 0.1011 0.0917 0.0980 0.1013 0.1044 0.0828 0.0834 0.0986 0.0992 0.1170 0.0919 0.0815 0.0996 0.0818 0.0960 0.0959 0.0995 0.0778 0.1223 0.0905 0.0979 0.1002 0.0987 0.1027 0.0870 0.0994 0.0881
va: 1.2214 2.0774 1.9399 2.1493 2.1439 2.1380 3.1832 2.7779 3.5855 3.8612 3.8687 4.0141 4.0430 4.0474 3.0861 4.2877 3.9062 3.1016 3.9149 3.8525 4.3661 3.9522 3.9989 4.0026 3.9026 3.9256 3.9209 3.8767 3.9188 1.0171 1.0193 1.0262 1.0186 1.0152 1.0082 1.0081 1.0118 0.9913 1.0227 0.9892 0.9935 0.9983 0.9939 1.0258 1.0268 1.0046 1.0100 1.0066 1.0099 1.0005 1.0001 1.0061 0.9954 1.0047 1.0114 1.0097
dispcorr: -0.035390042 hartree
energy: -1762.471971212221
dipole: -38.47552 36.90897 -1.56655 -12.03420 10.16397 -1.87023 -4.02953 4.11851 0.08899
magnitude: 2.44126 au
magnitude: 6.20519 debye
