program: Orca
programVersion: 5.0.2
elementType: O O O O C C C C C C C C C C C C C C C C C C C C C C C H H H H H H H H H H H H H H H H H H H H H H H H H H H H H H
charge: 0
multiplicity: 1
keywords: wb97x-d3
keywords: def2-TZVPP
keywords: def2/J RIJCOSX
keywords: DEFGRID2
keywords: scfconv7
keywords: smallprint printgap noloewdin
keywords: NOSOSCF
formula: C23H30O4
InChI: InChI=1/C23H30O4/c1-14-11-15(2)18(16(3)12-14)19-20(26-17(24)13-22(4,5)6)23(27-21(19)25)9-7-8-10-23/h11-12H,7-10,13H2,1-6H3
57 atoms
O  -2.876686 -1.753433 -0.178062
O  -0.857771 1.094085 0.515609
O  -1.477926 -3.454397 -0.50619
O  -0.215372 1.608109 -1.565269
C  -2.810843 -0.348874 0.107449
C  -3.543501 -0.031936 1.434235
C  -3.549941 0.459429 -0.97677
C  -4.521315 1.09224 1.097543
C  -4.897059 0.806013 -0.351197
C  -1.336366 -0.118307 0.152485
C  -0.644621 -1.230144 -0.083688
C  -1.647906 -2.280565 -0.287992
C  0.806309 -1.461074 -0.06198
C  1.847908 3.194845 0.241831
C  0.300943 3.135863 0.230736
C  -0.254119 1.900548 -0.402739
C  1.47452 -1.501057 1.166293
C  1.508301 -1.622284 -1.262779
C  2.428379 1.941825 0.892794
C  2.411765 3.344649 -1.169847
C  2.230445 4.42347 1.066123
C  2.854128 -1.681121 1.172793
C  2.887562 -1.786234 -1.213601
C  3.578476 -1.814306 -0.005677
C  0.734465 -1.336569 2.46093
C  0.795453 -1.624212 -2.583023
C  5.065233 -2.007408 0.01811
H  -2.85805 0.214637 2.245221
H  -4.091136 -0.924888 1.739719
H  -3.606032 -0.094277 -1.913652
H  -3.009627 1.385166 -1.182227
H  -4.023615 2.062694 1.16642
H  -5.374126 1.110913 1.775778
H  -5.57844 -0.046861 -0.403734
H  -5.380109 1.64703 -0.848179
H  -0.082085 3.991916 -0.331031
H  -0.0679 3.220327 1.253438
H  2.008924 1.767184 1.886169
H  3.510189 2.037121 1.003838
H  2.24785 1.050357 0.289005
H  1.972222 4.199949 -1.686662
H  3.490553 3.504415 -1.124676
H  2.244955 2.458599 -1.781989
H  3.315437 4.537148 1.103469
H  1.815531 5.338008 0.637248
H  1.868893 4.342543 2.093241
H  3.375436 -1.706524 2.12333
H  3.436216 -1.895067 -2.142832
H  -0.128692 -2.001111 2.524493
H  1.383388 -1.552733 3.308459
H  0.364427 -0.317539 2.588667
H  0.208187 -0.718363 -2.732425
H  1.502128 -1.701905 -3.407861
H  0.106556 -2.466862 -2.663684
H  5.326483 -3.059591 -0.112346
H  5.551957 -1.455868 -0.786353
H  5.497575 -1.679748 0.96276
elementType: O C H
totalener: -1195.58956050 hartree
nucrepener: 2715.13076768 hartree
electener: -3910.72032818 hartree
oneelecener: -7024.36341198 hartree
twoeener: 3113.64308381 hartree
cpcmener: -0.03900324 hartree
kineticenergy: 1190.20134265 hartree
xcener: -117.207595943618 hartree
chargesum: -0.0000000
charge: -0.294674 -0.299528 -0.466384 -0.437398 0.472777 -0.195170 -0.211811 -0.142344 -0.120462 0.080322 -0.091743 0.404429 0.104352 0.256467 -0.198284 0.414242 -0.122602 -0.108368 -0.326353 -0.338230 -0.339773 -0.149107 -0.123294 -0.015001 -0.251692 -0.229629 -0.219262 0.097281 0.098018 0.091290 0.100662 0.077977 0.081401 0.079274 0.079482 0.120432 0.107120 0.106547 0.106084 0.043410 0.101934 0.098044 0.090939 0.097266 0.101411 0.099847 0.122049 0.125020 0.113351 0.103697 0.102040 0.102584 0.098397 0.103665 0.105713 0.099160 0.094423
qa: -0.2947 -0.2995 -0.4664 -0.4374 0.4728 -0.1952 -0.2118 -0.1423 -0.1205 0.0803 -0.0917 0.4044 0.1044 0.2565 -0.1983 0.4142 -0.1226 -0.1084 -0.3264 -0.3382 -0.3398 -0.1491 -0.1233 -0.0150 -0.2517 -0.2296 -0.2193 0.0973 0.0980 0.0913 0.1007 0.0780 0.0814 0.0793 0.0795 0.1204 0.1071 0.1065 0.1061 0.0434 0.1019 0.0980 0.0909 0.0973 0.1014 0.0998 0.1220 0.1250 0.1134 0.1037 0.1020 0.1026 0.0984 0.1037 0.1057 0.0992 0.0944
va: 2.1262 2.1118 2.0417 2.0563 3.5698 3.9209 3.9482 3.9506 3.9041 4.0368 3.1587 4.2670 2.9146 3.7325 3.8825 4.0321 3.7726 3.8321 3.9425 3.9439 3.9191 3.8406 3.8775 3.7419 3.9203 3.9042 3.9049 1.0139 1.0181 1.0242 1.0186 1.0097 1.0152 1.0106 1.0145 1.0133 1.0279 1.0008 1.0069 1.0207 1.0029 1.0048 1.0098 1.0060 1.0025 1.0032 1.0119 1.0083 0.9957 1.0043 0.9954 1.0080 1.0056 1.0035 0.9937 0.9991 1.0035
dispcorr: -0.035574915 hartree
energy: -1195.625135411218
dipole: 14.24693 -13.94400 0.30292 21.71011 -18.35172 3.35838 5.39472 -3.78188 1.61284
magnitude: 3.73788 au
magnitude: 9.50094 debye
