program: Orca
programVersion: 5.0.2
elementType: O O O O C C C C C C C C C C C C C C C C C C C C C C C H H H H H H H H H H H H H H H H H H H H H H H H H H H H H H
charge: 0
multiplicity: 1
keywords: wb97x-d3
keywords: def2-TZVPP
keywords: def2/J RIJCOSX
keywords: DEFGRID2
keywords: scfconv7
keywords: smallprint printgap noloewdin
keywords: NOSOSCF
formula: C23H30O4
InChI: InChI=1/C23H30O4/c1-14-11-15(2)18(16(3)12-14)19-20(26-17(24)13-22(4,5)6)23(27-21(19)25)9-7-8-10-23/h11-12H,7-10,13H2,1-6H3
57 atoms
O  -2.832744 -1.654208 -0.188684
O  -0.77351 1.214285 -0.009436
O  -1.506526 -3.441276 -0.183029
O  0.548595 0.955326 1.781031
C  -2.706518 -0.230723 -0.109247
C  -3.461119 0.321417 1.116181
C  -3.359322 0.442269 -1.339702
C  -4.7558 0.897843 0.55226
C  -4.302931 1.501047 -0.772364
C  -1.226143 -0.053412 -0.012389
C  -0.582022 -1.221779 -0.003608
C  -1.628652 -2.242608 -0.122692
C  0.849335 -1.551977 0.035974
C  1.456136 3.407857 -0.449265
C  0.469828 3.103965 0.705454
C  0.131436 1.661331 0.908734
C  1.408915 -2.086081 1.203649
C  1.639404 -1.337166 -1.096867
C  2.670039 2.482892 -0.375126
C  0.784986 3.286065 -1.815193
C  1.909734 4.855585 -0.257005
C  2.77032 -2.361697 1.228419
C  2.999112 -1.628991 -1.032873
C  3.583346 -2.134717 0.121696
C  0.565696 -2.369002 2.411302
C  1.043558 -0.820551 -2.372482
C  5.046315 -2.460181 0.170191
H  -2.879564 1.127158 1.569657
H  -3.594648 -0.446532 1.877852
H  -3.929541 -0.316971 -1.87725
H  -2.625279 0.844364 -2.038081
H  -5.211629 1.625178 1.223948
H  -5.486647 0.104507 0.377212
H  -5.125633 1.722378 -1.451977
H  -3.764634 2.434707 -0.591898
H  -0.451712 3.671432 0.552625
H  0.916132 3.442961 1.641109
H  3.419411 2.781948 -1.110063
H  2.411867 1.442303 -0.587483
H  3.141434 2.516891 0.609306
H  -0.090506 3.934476 -1.887115
H  1.482077 3.583903 -2.600709
H  0.467347 2.268893 -2.040287
H  2.59205 5.153111 -1.055272
H  1.062028 5.543844 -0.271861
H  2.430541 4.988279 0.693276
H  3.208103 -2.760826 2.13698
H  3.614149 -1.458245 -1.909478
H  -0.106162 -1.545118 2.65023
H  -0.056455 -3.253118 2.259935
H  1.186491 -2.558594 3.285689
H  1.7809 -0.819999 -3.174046
H  0.198771 -1.430422 -2.697593
H  0.675699 0.200701 -2.269477
H  5.487809 -2.177002 1.125812
H  5.213021 -3.532198 0.04704
H  5.596945 -1.952211 -0.620615
elementType: O C H
totalener: -1195.58854151 hartree
nucrepener: 2712.24245672 hartree
electener: -3907.83099823 hartree
oneelecener: -7018.59541877 hartree
twoeener: 3110.76442054 hartree
cpcmener: -0.04218284 hartree
kineticenergy: 1190.21026160 hartree
xcener: -117.210109996577 hartree
chargesum: 0.0000000
charge: -0.297370 -0.293421 -0.470147 -0.419612 0.455252 -0.204391 -0.190699 -0.121123 -0.140143 0.129998 -0.079768 0.407654 0.079775 0.225840 -0.179114 0.393179 -0.126842 -0.158873 -0.310880 -0.337578 -0.338620 -0.129402 -0.120149 -0.020597 -0.243645 -0.246189 -0.219524 0.100475 0.089851 0.097561 0.095426 0.079450 0.079183 0.080953 0.077352 0.117027 0.108441 0.101065 0.058372 0.106818 0.104007 0.100090 0.094730 0.097113 0.100518 0.099020 0.123987 0.123662 0.099902 0.106251 0.101239 0.102557 0.117726 0.095342 0.099577 0.104588 0.094105
qa: -0.2974 -0.2934 -0.4701 -0.4196 0.4553 -0.2044 -0.1907 -0.1211 -0.1401 0.1300 -0.0798 0.4077 0.0798 0.2258 -0.1791 0.3932 -0.1268 -0.1589 -0.3109 -0.3376 -0.3386 -0.1294 -0.1201 -0.0206 -0.2436 -0.2462 -0.2195 0.1005 0.0899 0.0976 0.0954 0.0795 0.0792 0.0810 0.0774 0.1170 0.1084 0.1011 0.0584 0.1068 0.1040 0.1001 0.0947 0.0971 0.1005 0.0990 0.1240 0.1237 0.0999 0.1063 0.1012 0.1026 0.1177 0.0953 0.0996 0.1046 0.0941
va: 2.1226 2.1318 2.0380 2.0801 3.5887 3.9456 3.9193 3.9031 3.9502 3.9999 3.0523 4.2579 2.9252 3.7195 3.8670 4.0689 3.8321 3.8032 3.9467 3.9484 3.9249 3.8869 3.8298 3.7793 3.9107 3.9230 3.9038 1.0126 1.0239 1.0184 1.0150 1.0144 1.0099 1.0152 1.0101 1.0192 1.0207 1.0064 1.0096 1.0073 1.0048 1.0056 0.9942 1.0054 1.0036 1.0038 1.0083 1.0110 1.0068 1.0021 1.0044 1.0060 0.9970 0.9855 0.9987 0.9932 1.0036
dispcorr: -0.035182895 hartree
energy: -1195.623724406950
dipole: 10.60048 -10.58653 0.01395 23.83707 -19.98371 3.85336 -5.77391 5.15513 -0.61878
magnitude: 3.90275 au
magnitude: 9.92001 debye
