program: Orca
programVersion: 5.0.2
elementType: O O O O C C C C C C C C C C C C C C C C C C C C C C C H H H H H H H H H H H H H H H H H H H H H H H H H H H H H H
charge: 0
multiplicity: 1
keywords: wb97x-d3
keywords: def2-TZVPP
keywords: def2/J RIJCOSX
keywords: DEFGRID2
keywords: scfconv7
keywords: smallprint printgap noloewdin
keywords: NOSOSCF
formula: C23H30O4
InChI: InChI=1/C23H30O4/c1-14-11-15(2)18(16(3)12-14)19-20(26-17(24)13-22(4,5)6)23(27-21(19)25)9-7-8-10-23/h11-12H,7-10,13H2,1-6H3
57 atoms
O  -2.728583 -1.549946 0.311205
O  -0.456915 1.013268 -0.555092
O  -1.566218 -3.433104 0.538866
O  1.216277 1.001328 0.937204
C  -2.481029 -0.168111 0.033198
C  -2.954701 0.720509 1.2019
C  -3.290549 0.295443 -1.199339
C  -4.264445 1.33643 0.7209
C  -3.995725 1.57685 -0.759623
C  -0.999461 -0.149576 -0.155613
C  -0.453949 -1.352594 0.035705
C  -1.580626 -2.244971 0.329983
C  0.928399 -1.834242 -0.084402
C  0.801013 4.064083 0.018054
C  1.137334 2.747793 -0.725099
C  0.692123 1.512423 -0.009979
C  1.620588 -2.245202 1.063893
C  1.543224 -1.883493 -1.338907
C  1.55004 4.154142 1.346071
C  1.255626 5.204354 -0.891627
C  -0.70226 4.1833 0.262214
C  2.92694 -2.696586 0.934012
C  2.852986 -2.35026 -1.42684
C  3.560881 -2.757949 -0.304042
C  0.980394 -2.193413 2.419752
C  0.827011 -1.445075 -2.582724
C  4.969931 -3.259413 -0.410921
H  -2.226512 1.515543 1.375302
H  -3.031136 0.148123 2.126196
H  -4.027814 -0.475383 -1.42913
H  -2.671872 0.4204 -2.087935
H  -4.520625 2.243948 1.267216
H  -5.089845 0.631117 0.844968
H  -4.897363 1.769218 -1.340703
H  -3.334358 2.438635 -0.882417
H  2.221039 2.679147 -0.844659
H  0.693532 2.776019 -1.720814
H  1.391314 5.133956 1.79902
H  2.624414 4.02591 1.207292
H  1.212673 3.410219 2.067064
H  2.325512 5.146447 -1.100551
H  0.72728 5.18746 -1.846528
H  1.061794 6.169964 -0.42153
H  -1.067086 3.433732 0.967657
H  -0.938313 5.160541 0.687197
H  -1.270962 4.080219 -0.664125
H  3.466847 -3.00438 1.823062
H  3.328804 -2.39496 -2.400246
H  1.731148 -2.24992 3.206682
H  0.408911 -1.277138 2.569413
H  0.293938 -3.028207 2.570705
H  0.772095 -0.356717 -2.652647
H  1.346697 -1.796876 -3.473003
H  -0.195666 -1.821263 -2.622281
H  5.350544 -3.172287 -1.427657
H  5.639736 -2.703539 0.24661
H  5.039277 -4.308829 -0.119534
elementType: O C H
totalener: -1195.58972245 hartree
nucrepener: 2682.11604366 hartree
electener: -3877.70576611 hartree
oneelecener: -6958.31485612 hartree
twoeener: 3080.60909001 hartree
cpcmener: -0.04302986 hartree
kineticenergy: 1190.21197146 hartree
xcener: -117.209768776103 hartree
chargesum: -0.0000000
charge: -0.299221 -0.288193 -0.470268 -0.425222 0.487013 -0.240212 -0.186601 -0.112224 -0.154008 0.115866 -0.070070 0.404131 0.021450 0.250157 -0.201772 0.415891 -0.100120 -0.105127 -0.340536 -0.335435 -0.371181 -0.146583 -0.134198 -0.027106 -0.248131 -0.254638 -0.219218 0.116327 0.093071 0.097514 0.097302 0.079437 0.080693 0.083528 0.078486 0.118727 0.110743 0.098817 0.102894 0.091388 0.100436 0.100006 0.097474 0.099230 0.106045 0.106321 0.124545 0.125311 0.101984 0.099443 0.107691 0.107734 0.103337 0.109282 0.092093 0.102121 0.103573
qa: -0.2992 -0.2882 -0.4703 -0.4252 0.4870 -0.2402 -0.1866 -0.1122 -0.1540 0.1159 -0.0701 0.4041 0.0214 0.2502 -0.2018 0.4159 -0.1001 -0.1051 -0.3405 -0.3354 -0.3712 -0.1466 -0.1342 -0.0271 -0.2481 -0.2546 -0.2192 0.1163 0.0931 0.0975 0.0973 0.0794 0.0807 0.0835 0.0785 0.1187 0.1107 0.0988 0.1029 0.0914 0.1004 0.1000 0.0975 0.0992 0.1060 0.1063 0.1245 0.1253 0.1020 0.0994 0.1077 0.1077 0.1033 0.1093 0.0921 0.1021 0.1036
va: 2.1215 2.1397 2.0397 2.0757 3.5492 3.9558 3.9155 3.8839 3.9581 4.0253 3.0196 4.2599 3.0288 3.7209 3.8539 4.0310 3.8063 3.8284 3.9431 3.9136 3.9407 3.9014 3.8822 3.7906 3.9131 3.9241 3.9052 1.0003 1.0273 1.0190 1.0154 1.0146 1.0104 1.0172 1.0106 1.0159 1.0250 1.0048 1.0027 1.0105 1.0028 1.0041 1.0060 0.9980 1.0077 1.0013 1.0080 1.0106 1.0039 1.0050 1.0028 0.9937 1.0044 0.9966 1.0056 0.9957 0.9943
dispcorr: -0.033774903 hartree
energy: -1195.623497357028
dipole: 5.23384 -5.07429 0.15955 28.11575 -24.38647 3.72928 -2.04965 0.65414 -1.39551
magnitude: 3.98502 au
magnitude: 10.12912 debye
