program: Orca
programVersion: 5.0.2
elementType: O O O O C C C C C C C C C C C C C C C C C C C C C C C H H H H H H H H H H H H H H H H H H H H H H H H H H H H H H
charge: 0
multiplicity: 1
keywords: wb97x-d3
keywords: def2-TZVPP
keywords: def2/J RIJCOSX
keywords: DEFGRID2
keywords: scfconv7
keywords: smallprint printgap noloewdin
keywords: NOSOSCF
formula: C23H30O4
InChI: InChI=1/C23H30O4/c1-14-11-15(2)18(16(3)12-14)19-20(26-17(24)13-22(4,5)6)23(27-21(19)25)9-7-8-10-23/h11-12H,7-10,13H2,1-6H3
57 atoms
O  -2.719519 -1.601876 -0.271982
O  -0.487302 1.008814 0.553354
O  -1.528618 -3.469655 -0.469907
O  1.181758 0.998923 -0.94284
C  -2.494078 -0.211885 -0.013533
C  -3.307961 0.255125 1.213369
C  -2.97918 0.659067 -1.193016
C  -3.977932 1.555326 0.77705
C  -4.264763 1.316492 -0.700511
C  -1.012304 -0.167313 0.171808
C  -0.447654 -1.363773 -0.008087
C  -1.56059 -2.277948 -0.28228
C  0.944439 -1.819797 0.10267
C  0.748167 4.062877 -0.050758
C  1.096137 2.756854 0.705693
C  0.657707 1.512722 0.002938
C  1.582625 -1.827821 1.346509
C  1.625306 -2.242558 -1.048503
C  -0.756715 4.167731 -0.292752
C  1.196157 5.216624 0.845497
C  1.493831 4.145912 -1.380843
C  2.901528 -2.270441 1.421726
C  2.941197 -2.668697 -0.931301
C  3.596659 -2.693042 0.29662
C  0.885659 -1.365828 2.592587
C  0.966162 -2.223649 -2.396249
C  5.013093 -3.175072 0.391458
H  -2.699345 0.352885 2.112556
H  -4.068068 -0.500308 1.420508
H  -3.091887 0.064308 -2.099146
H  -2.238126 1.431667 -1.408278
H  -3.292439 2.399212 0.893379
H  -4.870112 1.77381 1.363712
H  -5.112141 0.635619 -0.812879
H  -4.49942 2.228584 -1.248984
H  0.654979 2.792644 1.702482
H  2.180735 2.696899 0.82244
H  -1.322203 4.068438 0.636121
H  -1.11795 3.408846 -0.990629
H  -1.00179 5.139215 -0.726014
H  0.66839 5.207317 1.801114
H  2.266801 5.167233 1.053954
H  0.995864 6.175494 0.363878
H  1.160993 3.392687 -2.095401
H  1.326864 5.120644 -1.842867
H  2.570237 4.026817 -1.242561
H  3.395695 -2.28218 2.386919
H  3.472101 -2.984376 -1.822951
H  1.420003 -1.699795 3.481067
H  0.832997 -0.276119 2.641805
H  -0.136402 -1.740168 2.656971
H  1.706648 -2.30429 -3.190782
H  0.273288 -3.057969 -2.517742
H  0.398117 -1.307585 -2.561545
H  5.074887 -4.25137 0.220628
H  5.646549 -2.698381 -0.357403
H  5.441058 -2.972286 1.372314
elementType: O C H
totalener: -1195.58961251 hartree
nucrepener: 2683.87009194 hartree
electener: -3879.45970445 hartree
oneelecener: -6961.82164222 hartree
twoeener: 3082.36193777 hartree
cpcmener: -0.04315431 hartree
kineticenergy: 1190.20459003 hartree
xcener: -117.208367853067 hartree
chargesum: -0.0000000
charge: -0.298905 -0.287902 -0.471390 -0.424580 0.497129 -0.183737 -0.243998 -0.157136 -0.112514 0.103506 -0.062550 0.403641 0.017683 0.251052 -0.201968 0.414241 -0.099300 -0.104668 -0.372893 -0.335438 -0.340581 -0.136146 -0.145111 -0.026050 -0.254474 -0.246430 -0.220426 0.097964 0.096776 0.092917 0.117187 0.079065 0.083798 0.081461 0.079393 0.110857 0.118838 0.107439 0.099073 0.106351 0.099947 0.100474 0.097440 0.091551 0.098868 0.102875 0.124899 0.124466 0.103753 0.107224 0.109351 0.101432 0.107147 0.099796 0.104122 0.101410 0.093073
qa: -0.2989 -0.2879 -0.4714 -0.4246 0.4971 -0.1837 -0.2440 -0.1571 -0.1125 0.1035 -0.0625 0.4036 0.0177 0.2511 -0.2020 0.4142 -0.0993 -0.1047 -0.3729 -0.3354 -0.3406 -0.1361 -0.1451 -0.0261 -0.2545 -0.2464 -0.2204 0.0980 0.0968 0.0929 0.1172 0.0791 0.0838 0.0815 0.0794 0.1109 0.1188 0.1074 0.0991 0.1064 0.0999 0.1005 0.0974 0.0916 0.0989 0.1029 0.1249 0.1245 0.1038 0.1072 0.1094 0.1014 0.1071 0.0998 0.1041 0.1014 0.0931
va: 2.1225 2.1418 2.0385 2.0756 3.5365 3.9147 3.9516 3.9599 3.8815 4.0380 3.0138 4.2589 3.0319 3.7200 3.8528 4.0321 3.8203 3.8137 3.9406 3.9130 3.9426 3.8860 3.9007 3.7881 3.9238 3.9114 3.9051 1.0151 1.0190 1.0274 0.9997 1.0112 1.0173 1.0100 1.0147 1.0251 1.0159 1.0007 0.9985 1.0079 1.0041 1.0028 1.0060 1.0104 1.0048 1.0026 1.0106 1.0083 1.0042 0.9936 0.9970 1.0040 1.0034 1.0045 0.9937 0.9967 1.0051
dispcorr: -0.033856508 hartree
energy: -1195.623469017054
dipole: 5.04324 -4.92048 0.12276 28.30985 -24.54558 3.76427 1.65939 -0.31628 1.34310
magnitude: 3.99859 au
magnitude: 10.16361 debye
