program: Orca
programVersion: 5.0.2
elementType: O O O O C C C C C C C C C C C C C C C C C C C C C C C H H H H H H H H H H H H H H H H H H H H H H H H H H H H H H
charge: 0
multiplicity: 1
keywords: wb97x-d3
keywords: def2-TZVPP
keywords: def2/J RIJCOSX
keywords: DEFGRID2
keywords: scfconv7
keywords: smallprint printgap noloewdin
keywords: NOSOSCF
formula: C23H30O4
InChI: InChI=1/C23H30O4/c1-14-11-15(2)18(16(3)12-14)19-20(26-17(24)13-22(4,5)6)23(27-21(19)25)9-7-8-10-23/h11-12H,7-10,13H2,1-6H3
57 atoms
O  -2.886468 -1.613037 0.030879
O  -0.769531 1.223507 -0.336092
O  -1.554023 -3.386674 0.206471
O  -0.016228 1.340239 1.769049
C  -2.763519 -0.191716 -0.118349
C  -3.478537 0.502239 1.043684
C  -3.514492 0.274421 -1.386635
C  -4.926678 0.567945 0.574482
C  -4.787149 0.981468 -0.889435
C  -1.282425 -0.012514 -0.148221
C  -0.636358 -1.169758 -0.03219
C  -1.680501 -2.196865 0.083168
C  0.804497 -1.453998 -0.054635
C  1.885079 3.231834 -0.106498
C  0.38833 3.195421 0.289439
C  -0.120933 1.847442 0.689735
C  1.471024 -1.804137 1.126677
C  1.498054 -1.371257 -1.266886
C  2.77457 2.754893 1.04036
C  2.140245 2.376296 -1.345447
C  2.211715 4.69107 -0.422678
C  2.841264 -2.030624 1.077993
C  2.868356 -1.61375 -1.273186
C  3.558072 -1.937054 -0.110986
C  0.73418 -1.966932 2.422975
C  0.789368 -1.041251 -2.548295
C  5.034486 -2.199195 -0.130793
H  -3.088113 1.517828 1.151913
H  -3.318521 -0.017656 1.988966
H  -3.74059 -0.595412 -2.003849
H  -2.896303 0.935782 -1.994298
H  -5.523889 1.267704 1.159509
H  -5.400041 -0.413904 0.657024
H  -5.661387 0.727201 -1.488927
H  -4.657837 2.064002 -0.95201
H  -0.208599 3.584564 -0.537378
H  0.238443 3.855127 1.147013
H  3.825776 2.896029 0.781245
H  2.641562 1.69466 1.260268
H  2.584908 3.313755 1.959186
H  1.992784 1.313173 -1.148173
H  1.48957 2.662177 -2.174697
H  3.172091 2.494894 -1.682515
H  3.258479 4.797941 -0.714107
H  1.599623 5.069981 -1.244186
H  2.041861 5.335157 0.442916
H  3.362696 -2.289659 1.99354
H  3.408605 -1.547719 -2.211203
H  -0.053182 -1.226049 2.554872
H  0.262526 -2.950417 2.48135
H  1.413036 -1.88588 3.271415
H  -0.065275 -1.698869 -2.717499
H  0.410952 -0.017618 -2.559165
H  1.460117 -1.145967 -3.400469
H  5.474505 -1.953113 -1.096766
H  5.553563 -1.615736 0.631109
H  5.251265 -3.250114 0.07151
elementType: O C H
totalener: -1195.60258619 hartree
nucrepener: 2709.83075456 hartree
electener: -3905.43334074 hartree
oneelecener: -7013.83871467 hartree
twoeener: 3108.40537392 hartree
cpcmener: -0.03225432 hartree
kineticenergy: 1190.20077913 hartree
xcener: -117.204607706120 hartree
chargesum: -0.0000000
charge: -0.295133 -0.306081 -0.429719 -0.404706 0.454166 -0.206515 -0.211243 -0.131602 -0.123974 0.104524 -0.057818 0.374214 0.134222 0.254014 -0.197130 0.379877 -0.131535 -0.145744 -0.336412 -0.318354 -0.332983 -0.137783 -0.109342 -0.023323 -0.252364 -0.245376 -0.219905 0.096262 0.095294 0.096284 0.090988 0.078893 0.078972 0.078026 0.080365 0.108982 0.117059 0.098861 0.084909 0.102219 0.039660 0.105701 0.103680 0.096629 0.099443 0.098664 0.121456 0.119755 0.099259 0.111359 0.101705 0.115443 0.097969 0.101497 0.091320 0.101063 0.104309
qa: -0.2951 -0.3061 -0.4297 -0.4047 0.4542 -0.2065 -0.2112 -0.1316 -0.1240 0.1045 -0.0578 0.3742 0.1342 0.2540 -0.1971 0.3799 -0.1315 -0.1457 -0.3364 -0.3184 -0.3330 -0.1378 -0.1093 -0.0233 -0.2524 -0.2454 -0.2199 0.0963 0.0953 0.0963 0.0910 0.0789 0.0790 0.0780 0.0804 0.1090 0.1171 0.0989 0.0849 0.1022 0.0397 0.1057 0.1037 0.0966 0.0994 0.0987 0.1215 0.1198 0.0993 0.1114 0.1017 0.1154 0.0980 0.1015 0.0913 0.1011 0.1043
va: 2.1296 2.1068 2.0896 2.0933 3.6385 3.9732 3.9393 3.9304 3.9183 3.9492 3.1377 4.3179 2.9216 3.7112 3.8853 4.0686 3.8378 3.8324 3.9546 3.9312 3.9223 3.8943 3.8203 3.7865 3.9110 3.9223 3.9044 1.0149 1.0212 1.0180 1.0143 1.0141 1.0136 1.0140 1.0062 1.0270 1.0160 1.0049 1.0047 1.0051 1.0257 1.0049 1.0094 1.0061 1.0034 1.0035 1.0077 1.0119 1.0103 0.9999 1.0037 0.9954 0.9951 1.0052 1.0057 0.9968 0.9940
dispcorr: -0.035171633 hartree
energy: -1195.637757819020
dipole: 13.75082 -13.41378 0.33704 21.36551 -18.04735 3.31817 -4.41860 3.31668 -1.10192
magnitude: 3.51256 au
magnitude: 8.92822 debye
