program: Orca
programVersion: 5.0.2
elementType: O O O O C C C C C C C C C C C C C C C C C C C C C C C H H H H H H H H H H H H H H H H H H H H H H H H H H H H H H
charge: 0
multiplicity: 1
keywords: wb97x-d3
keywords: def2-TZVPP
keywords: def2/J RIJCOSX
keywords: DEFGRID2
keywords: scfconv7
keywords: smallprint printgap noloewdin
keywords: NOSOSCF
formula: C23H30O4
InChI: InChI=1/C23H30O4/c1-14-11-15(2)18(16(3)12-14)19-20(26-17(24)13-22(4,5)6)23(27-21(19)25)9-7-8-10-23/h11-12H,7-10,13H2,1-6H3
57 atoms
O  -2.731864 -1.43459 0.132804
O  -0.240495 1.005785 -0.532294
O  -1.676752 -3.371585 0.416968
O  0.852057 1.116439 1.419761
C  -2.403934 -0.06553 -0.142287
C  -2.985204 0.851143 0.957602
C  -3.09793 0.372647 -1.43476
C  -4.161998 1.597322 0.308433
C  -4.477557 0.812644 -0.963141
C  -0.914967 -0.112467 -0.204564
C  -0.441654 -1.338364 0.013356
C  -1.623719 -2.186036 0.217754
C  0.942366 -1.829494 0.009842
C  0.729414 4.060255 -0.130542
C  1.410681 2.682755 -0.326034
C  0.690908 1.537542 0.311487
C  1.536392 -2.241277 1.20796
C  1.663281 -1.869831 -1.192274
C  -0.652385 4.100658 -0.781212
C  0.609783 4.397071 1.354093
C  1.633127 5.088654 -0.810458
C  2.8577 -2.677316 1.186602
C  2.977843 -2.318575 -1.170094
C  3.594809 -2.721771 0.010182
C  0.779987 -2.226876 2.503837
C  1.046666 -1.446968 -2.493984
C  5.01667 -3.197593 0.000441
H  -2.233692 1.540866 1.342255
H  -3.302057 0.23638 1.800077
H  -3.094235 -0.419273 -2.184686
H  -2.56476 1.229707 -1.855177
H  -3.858234 2.612438 0.044337
H  -5.015985 1.681982 0.980196
H  -5.099865 -0.057584 -0.73957
H  -5.004169 1.406775 -1.710277
H  2.406748 2.720612 0.118658
H  1.529701 2.4896 -1.394224
H  -0.615746 3.798987 -1.829966
H  -1.052861 5.115889 -0.74766
H  -1.373178 3.459109 -0.27066
H  -0.076374 3.729205 1.878438
H  1.576911 4.343725 1.858244
H  0.227186 5.411726 1.482292
H  2.631731 5.097962 -0.368745
H  1.743276 4.881438 -1.87701
H  1.217721 6.093163 -0.709711
H  3.322661 -2.986263 2.116392
H  3.535412 -2.354562 -2.100073
H  1.461156 -2.280613 3.35231
H  0.175017 -1.327918 2.621287
H  0.105393 -3.081643 2.58011
H  1.649076 -1.787611 -3.335466
H  0.04089 -1.848972 -2.623295
H  0.971209 -0.36084 -2.574981
H  5.684382 -2.44976 -0.430827
H  5.373312 -3.420652 1.005355
H  5.127011 -4.103685 -0.598509
elementType: O C H
totalener: -1195.60271150 hartree
nucrepener: 2681.01277315 hartree
electener: -3876.61548465 hartree
oneelecener: -6955.95420535 hartree
twoeener: 3079.33872070 hartree
cpcmener: -0.03360832 hartree
kineticenergy: 1190.20696028 hartree
xcener: -117.205194280095 hartree
chargesum: 0.0000000
charge: -0.295872 -0.298137 -0.431785 -0.398731 0.441816 -0.233510 -0.196759 -0.134684 -0.121862 0.146671 -0.074102 0.378921 0.054671 0.239694 -0.207241 0.388228 -0.099600 -0.094921 -0.326246 -0.338607 -0.331555 -0.129806 -0.144672 -0.023203 -0.252371 -0.250841 -0.221957 0.093550 0.102764 0.093496 0.094434 0.082139 0.081535 0.078547 0.079082 0.114015 0.113860 0.103729 0.101537 0.065911 0.091621 0.102168 0.099022 0.099818 0.099051 0.096294 0.122012 0.120640 0.100177 0.100635 0.109720 0.101039 0.108575 0.104608 0.101963 0.090996 0.103525
qa: -0.2959 -0.2981 -0.4318 -0.3987 0.4418 -0.2335 -0.1968 -0.1347 -0.1219 0.1467 -0.0741 0.3789 0.0547 0.2397 -0.2072 0.3882 -0.0996 -0.0949 -0.3262 -0.3386 -0.3316 -0.1298 -0.1447 -0.0232 -0.2524 -0.2508 -0.2220 0.0936 0.1028 0.0935 0.0944 0.0821 0.0815 0.0785 0.0791 0.1140 0.1139 0.1037 0.1015 0.0659 0.0916 0.1022 0.0990 0.0998 0.0991 0.0963 0.1220 0.1206 0.1002 0.1006 0.1097 0.1010 0.1086 0.1046 0.1020 0.0910 0.1035
va: 2.1254 2.1107 2.0884 2.1015 3.6525 3.9397 3.9631 3.9186 3.9177 3.9405 3.0960 4.3045 3.0699 3.7164 3.8737 4.0693 3.8246 3.8173 3.9498 3.9436 3.9187 3.8996 3.8976 3.7991 3.9110 3.9230 3.9053 1.0139 1.0197 1.0227 1.0140 1.0028 1.0154 1.0139 1.0149 1.0193 1.0191 1.0043 1.0087 1.0060 1.0077 1.0043 1.0044 1.0033 1.0039 1.0063 1.0098 1.0100 1.0041 1.0072 1.0018 1.0048 0.9961 0.9955 0.9954 1.0063 0.9944
dispcorr: -0.033873431 hartree
energy: -1195.636584927338
dipole: 4.97057 -4.36700 0.60357 27.36995 -24.02356 3.34640 -3.88871 2.48494 -1.40377
magnitude: 3.67875 au
magnitude: 9.35065 debye
