program: Orca
programVersion: 5.0.2
elementType: O O O O C C C C C C C C C C C C C C C C C C C C C C C H H H H H H H H H H H H H H H H H H H H H H H H H H H H H H
charge: 0
multiplicity: 1
keywords: wb97x-d3
keywords: def2-TZVPP
keywords: def2/J RIJCOSX
keywords: DEFGRID2
keywords: scfconv7
keywords: smallprint printgap noloewdin
keywords: NOSOSCF
formula: C23H30O4
InChI: InChI=1/C23H30O4/c1-14-11-15(2)18(16(3)12-14)19-20(26-17(24)13-22(4,5)6)23(27-21(19)25)9-7-8-10-23/h11-12H,7-10,13H2,1-6H3
57 atoms
O  -2.81054 -1.718224 0.086969
O  -0.810117 1.199665 0.109097
O  -1.44685 -3.469652 -0.035337
O  0.399514 1.118401 -1.774087
C  -2.718666 -0.291344 0.0953
C  -3.398029 0.290268 1.357258
C  -3.477323 0.317043 -1.102126
C  -4.338408 1.379193 0.846861
C  -4.778854 0.852653 -0.514262
C  -1.24235 -0.072806 0.022024
C  -0.571913 -1.222267 -0.061601
C  -1.595009 -2.275645 -0.012576
C  0.869253 -1.50607 -0.114391
C  1.42626 3.347702 0.639832
C  0.391093 3.154783 -0.496702
C  0.037592 1.736127 -0.816788
C  1.643073 -1.359834 1.039947
C  1.45335 -1.935148 -1.314088
C  0.793704 3.152276 2.016321
C  2.604646 2.392291 0.45902
C  1.924952 4.789543 0.535172
C  3.011515 -1.607096 0.967825
C  2.821634 -2.171042 -1.344329
C  3.619526 -2.004919 -0.215463
C  1.023563 -0.967259 2.348463
C  0.626761 -2.14905 -2.546913
C  5.093029 -2.276562 -0.277658
H  -2.680088 0.645202 2.097444
H  -3.973705 -0.508255 1.829024
H  -3.602216 -0.413174 -1.90192
H  -2.903921 1.149647 -1.516311
H  -3.801358 2.323651 0.725228
H  -5.167427 1.559679 1.531556
H  -5.507428 0.047047 -0.391286
H  -5.235359 1.615692 -1.145296
H  0.79729 3.577347 -1.416656
H  -0.520975 3.707835 -0.255302
H  0.437626 2.136111 2.179392
H  -0.051203 3.828151 2.163966
H  1.523793 3.363313 2.800042
H  3.38836 2.610768 1.187084
H  2.319302 1.347467 0.603943
H  3.04763 2.480597 -0.535535
H  2.425733 4.9726 -0.417943
H  1.104382 5.505319 0.622649
H  2.639404 5.00828 1.331286
H  3.614159 -1.486752 1.861406
H  3.278458 -2.491809 -2.274601
H  0.225057 -1.654146 2.637147
H  1.765207 -0.970129 3.146787
H  0.586261 0.031263 2.317339
H  -0.002295 -1.288054 -2.773794
H  1.259042 -2.337049 -3.41459
H  -0.036067 -3.010054 -2.437451
H  5.293587 -3.347344 -0.355349
H  5.550571 -1.803877 -1.147765
H  5.60747 -1.911265 0.610787
elementType: O C H
totalener: -1195.60021446 hartree
nucrepener: 2715.71297160 hartree
electener: -3911.31318606 hartree
oneelecener: -7025.46805488 hartree
twoeener: 3114.15486882 hartree
cpcmener: -0.03347416 hartree
kineticenergy: 1190.20595171 hartree
xcener: -117.206600550064 hartree
chargesum: -0.0000000
charge: -0.287522 -0.296590 -0.434514 -0.392277 0.453037 -0.187381 -0.208317 -0.143555 -0.119996 0.104557 -0.085232 0.379147 0.090949 0.218673 -0.177779 0.370287 -0.149153 -0.109516 -0.334201 -0.297909 -0.335779 -0.114083 -0.129379 -0.018727 -0.248679 -0.240510 -0.219838 0.093276 0.097544 0.090251 0.099073 0.075763 0.081265 0.079925 0.078721 0.107313 0.113654 0.094286 0.101835 0.099302 0.099696 0.047758 0.107554 0.097766 0.099615 0.096487 0.119383 0.120805 0.118736 0.100975 0.093847 0.101684 0.096716 0.105948 0.104177 0.099653 0.091281
qa: -0.2875 -0.2966 -0.4345 -0.3923 0.4530 -0.1874 -0.2083 -0.1436 -0.1200 0.1046 -0.0852 0.3791 0.0909 0.2187 -0.1778 0.3703 -0.1492 -0.1095 -0.3342 -0.2979 -0.3358 -0.1141 -0.1294 -0.0187 -0.2487 -0.2405 -0.2198 0.0933 0.0975 0.0903 0.0991 0.0758 0.0813 0.0799 0.0787 0.1073 0.1137 0.0943 0.1018 0.0993 0.0997 0.0478 0.1076 0.0978 0.0996 0.0965 0.1194 0.1208 0.1187 0.1010 0.0938 0.1017 0.0967 0.1059 0.1042 0.0997 0.0913
va: 2.1296 2.1228 2.0826 2.1111 3.5939 3.9128 3.9430 3.9505 3.8989 4.0135 3.0615 4.2896 2.9296 3.7303 3.8612 4.0990 3.7880 3.8390 3.9470 3.9432 3.9252 3.8306 3.8906 3.7865 3.9200 3.9030 3.9053 1.0152 1.0186 1.0245 1.0128 1.0106 1.0153 1.0100 1.0146 1.0213 1.0192 0.9963 1.0053 1.0058 1.0068 1.0183 1.0082 1.0044 1.0036 1.0056 1.0122 1.0091 0.9963 1.0064 0.9871 1.0080 1.0053 1.0029 0.9935 0.9976 1.0053
dispcorr: -0.035408318 hartree
energy: -1195.635622779891
dipole: 10.64826 -10.62503 0.02323 23.28201 -19.74666 3.53535 7.15916 -6.34114 0.81802
magnitude: 3.62883 au
magnitude: 9.22376 debye
