program: Orca
programVersion: 5.0.2
elementType: O O O O C C C C C C C C C C C C C C C C C C C C C C C H H H H H H H H H H H H H H H H H H H H H H H H H H H H H H
charge: 0
multiplicity: 1
keywords: wb97x-d3
keywords: def2-TZVPP
keywords: def2/J RIJCOSX
keywords: DEFGRID2
keywords: scfconv7
keywords: smallprint printgap noloewdin
keywords: NOSOSCF
formula: C23H30O4
InChI: InChI=1/C23H30O4/c1-14-11-15(2)18(16(3)12-14)19-20(26-17(24)13-22(4,5)6)23(27-21(19)25)9-7-8-10-23/h11-12H,7-10,13H2,1-6H3
57 atoms
O  -2.927716 -1.484633 0.007625
O  -0.733663 1.305263 -0.374543
O  -1.618285 -3.287893 0.17346
O  -0.213556 1.498661 1.797103
C  -2.771082 -0.076133 -0.128949
C  -3.490692 0.622912 1.022932
C  -3.540644 0.411928 -1.357854
C  -4.967486 0.477247 0.65072
C  -5.006312 0.498847 -0.894176
C  -1.288085 0.082981 -0.178029
C  -0.665215 -1.085304 -0.074156
C  -1.728122 -2.106334 0.05425
C  0.775782 -1.3705 -0.100415
C  2.00481 3.099211 -0.072143
C  0.502019 3.223263 0.283298
C  -0.157823 1.939235 0.690102
C  1.45008 -1.674503 1.087924
C  1.463211 -1.322995 -1.315441
C  2.784163 2.433288 1.061943
C  2.200168 2.306846 -1.362631
C  2.522905 4.524567 -0.27547
C  2.821651 -1.881203 1.040814
C  2.835825 -1.545771 -1.319306
C  3.533876 -1.815532 -0.151178
C  0.709763 -1.799306 2.386124
C  0.743422 -1.046676 -2.60477
C  5.014656 -2.05896 -0.167129
H  -3.202607 1.676985 1.035375
H  -3.228241 0.200448 1.992577
H  -3.389597 -0.247112 -2.21346
H  -3.164473 1.398132 -1.638462
H  -5.57641 1.264314 1.094909
H  -5.351579 -0.471352 1.026041
H  -5.587303 -0.33921 -1.278425
H  -5.477067 1.406326 -1.27371
H  -0.02924 3.664438 -0.563311
H  0.402705 3.903879 1.131303
H  3.853816 2.467505 0.847965
H  2.51699 1.383301 1.189241
H  2.620453 2.937915 2.015587
H  1.922682 1.260195 -1.247302
H  1.618258 2.726436 -2.186013
H  3.25024 2.323429 -1.659706
H  3.581026 4.513767 -0.541616
H  1.987817 5.035942 -1.078547
H  2.417435 5.123586 0.631111
H  3.348399 -2.105147 1.962154
H  3.370838 -1.506496 -2.261647
H  0.080586 -0.931459 2.579149
H  0.066853 -2.680916 2.379165
H  1.399932 -1.902678 3.22217
H  1.413131 -1.161506 -3.455987
H  -0.093239 -1.731541 -2.749764
H  0.340973 -0.033023 -2.641953
H  5.457078 -1.790186 -1.12555
H  5.521913 -1.481369 0.606337
H  5.241995 -3.110756 0.015293
totalener: -1195.57658810 hartree
nucrepener: 2720.52006371 hartree
electener: -3916.09665181 hartree
oneelecener: -7034.74870768 hartree
twoeener: 3118.65205586 hartree
kineticenergy: 1190.25275616 hartree
xcener: -117.207368586593 hartree
chargesum: -0.0000000
charge: -0.265646 -0.309368 -0.309781 -0.322131 0.367549 -0.202362 -0.193974 -0.135958 -0.138160 0.126476 -0.101018 0.305205 0.174465 0.183502 -0.188874 0.304627 -0.138245 -0.093787 -0.286997 -0.256710 -0.295398 -0.091290 -0.082369 -0.007113 -0.237765 -0.233400 -0.224232 0.078649 0.095925 0.088868 0.083446 0.076305 0.091275 0.084986 0.072870 0.096942 0.108558 0.086365 0.085077 0.096180 0.019415 0.092399 0.090554 0.088770 0.089319 0.089947 0.090125 0.085509 0.106697 0.115989 0.076375 0.088096 0.112069 0.087534 0.079053 0.092319 0.103141
qa: -0.2656 -0.3094 -0.3098 -0.3221 0.3675 -0.2024 -0.1940 -0.1360 -0.1382 0.1265 -0.1010 0.3052 0.1745 0.1835 -0.1889 0.3046 -0.1382 -0.0938 -0.2870 -0.2567 -0.2954 -0.0913 -0.0824 -0.0071 -0.2378 -0.2334 -0.2242 0.0786 0.0959 0.0889 0.0834 0.0763 0.0913 0.0850 0.0729 0.0969 0.1086 0.0864 0.0851 0.0962 0.0194 0.0924 0.0906 0.0888 0.0893 0.0899 0.0901 0.0855 0.1067 0.1160 0.0764 0.0881 0.1121 0.0875 0.0791 0.0923 0.1031
va: 2.1597 2.0795 2.2099 2.1651 3.8098 3.9958 3.9515 3.9019 3.9018 3.8228 3.1791 4.3711 2.9725 3.8245 3.8734 4.1263 3.9005 3.8487 3.9587 3.9180 3.9223 3.8916 3.8676 3.8218 3.9072 3.9265 3.9138 1.0176 1.0246 1.0217 1.0199 1.0123 1.0159 1.0111 1.0095 1.0275 1.0190 1.0063 1.0104 1.0108 1.0488 1.0102 1.0147 1.0099 1.0066 1.0076 1.0149 1.0186 1.0075 1.0018 1.0105 1.0101 0.9976 0.9947 1.0083 0.9989 0.9937
dispcorr: -0.036019880 hartree
energy: -1195.612607981884
dipole: 14.54610 -14.07414 0.47196 19.46287 -17.35692 2.10595 -3.96043 3.30352 -0.65691
magnitude: 2.25595 au
magnitude: 5.73416 debye
