program: Orca
programVersion: 5.0.2
elementType: O O O O C C C C C C C C C C C C C C C C C C C C C C C H H H H H H H H H H H H H H H H H H H H H H H H H H H H H H
charge: 0
multiplicity: 1
keywords: wb97x-d3
keywords: def2-TZVPP
keywords: def2/J RIJCOSX
keywords: DEFGRID2
keywords: scfconv7
keywords: smallprint printgap noloewdin
keywords: NOSOSCF
formula: C23H30O4
InChI: InChI=1/C23H30O4/c1-14-11-15(2)18(16(3)12-14)19-20(26-17(24)13-22(4,5)6)23(27-21(19)25)9-7-8-10-23/h11-12H,7-10,13H2,1-6H3
57 atoms
O  -2.923131 -1.488584 0.017594
O  -0.735023 1.301733 -0.391481
O  -1.61127 -3.288775 0.195105
O  -0.204326 1.510529 1.776273
C  -2.768266 -0.081239 -0.12984
C  -3.485868 0.625904 1.018356
C  -3.54322 0.395941 -1.358773
C  -4.964932 0.480173 0.651475
C  -5.008452 0.454586 -0.893773
C  -1.285639 0.079542 -0.183935
C  -0.660989 -1.086913 -0.071172
C  -1.722636 -2.108385 0.066232
C  0.779485 -1.3743 -0.097222
C  1.992212 3.142193 -0.066386
C  0.479068 3.23792 0.249997
C  -0.160942 1.947095 0.667171
C  1.45279 -1.679497 1.09141
C  1.466373 -1.333259 -1.312831
C  2.764723 2.544693 1.109482
C  2.236234 2.302964 -1.318656
C  2.475297 4.572168 -0.316511
C  2.822548 -1.897749 1.043385
C  2.836973 -1.567938 -1.31759
C  3.533711 -1.842293 -0.149715
C  0.713437 -1.79314 2.391256
C  0.74841 -1.050548 -2.601645
C  5.01183 -2.101379 -0.167347
H  -3.195993 1.679403 1.0239
H  -3.222047 0.209276 1.990086
H  -3.381327 -0.256982 -2.216795
H  -3.184323 1.389673 -1.63478
H  -5.565314 1.286293 1.072191
H  -5.357646 -0.452155 1.056623
H  -5.561818 -0.41369 -1.248999
H  -5.508611 1.333063 -1.301014
H  -0.040548 3.647972 -0.618939
H  0.342998 3.934456 1.079928
H  3.837272 2.603775 0.91711
H  2.52494 1.493369 1.272003
H  2.565053 3.080565 2.03882
H  1.9787 1.255307 -1.167367
H  1.66556 2.675783 -2.171798
H  3.292432 2.331261 -1.591949
H  3.538888 4.581348 -0.559909
H  1.943696 5.035709 -1.150276
H  2.333239 5.203589 0.562674
H  3.348458 -2.123319 1.964797
H  3.371513 -1.53475 -2.260413
H  0.086338 -0.922386 2.578062
H  0.068846 -2.673527 2.392015
H  1.404292 -1.891252 3.227396
H  -0.098636 -1.723115 -2.743554
H  0.361547 -0.030874 -2.640241
H  1.414878 -1.177592 -3.453664
H  5.455415 -1.839523 -1.127144
H  5.526666 -1.527601 0.603934
H  5.228099 -3.155154 0.017018
totalener: -1195.57670838 hartree
nucrepener: 2717.20659072 hartree
electener: -3912.78329910 hartree
oneelecener: -7028.12868326 hartree
twoeener: 3115.34538415 hartree
kineticenergy: 1190.25733893 hartree
xcener: -117.208030539008 hartree
chargesum: -0.0000000
charge: -0.265419 -0.309690 -0.309764 -0.322588 0.367543 -0.204533 -0.192041 -0.135824 -0.138990 0.130490 -0.103223 0.303907 0.186113 0.183720 -0.189110 0.304646 -0.140074 -0.105608 -0.288204 -0.261322 -0.294862 -0.092434 -0.077214 -0.008445 -0.237636 -0.235008 -0.223753 0.078936 0.096362 0.088492 0.082760 0.076054 0.091166 0.085904 0.072895 0.096781 0.108392 0.086249 0.088919 0.094580 0.024341 0.091953 0.091069 0.088774 0.089251 0.090056 0.090419 0.085450 0.106594 0.116135 0.076507 0.111365 0.087916 0.087746 0.078968 0.092337 0.102953
qa: -0.2654 -0.3097 -0.3098 -0.3226 0.3675 -0.2045 -0.1920 -0.1358 -0.1390 0.1305 -0.1032 0.3039 0.1861 0.1837 -0.1891 0.3046 -0.1401 -0.1056 -0.2882 -0.2613 -0.2949 -0.0924 -0.0772 -0.0084 -0.2376 -0.2350 -0.2238 0.0789 0.0964 0.0885 0.0828 0.0761 0.0912 0.0859 0.0729 0.0968 0.1084 0.0862 0.0889 0.0946 0.0243 0.0920 0.0911 0.0888 0.0893 0.0901 0.0904 0.0855 0.1066 0.1161 0.0765 0.1114 0.0879 0.0877 0.0790 0.0923 0.1030
va: 2.1595 2.0800 2.2101 2.1651 3.8102 3.9958 3.9534 3.8996 3.9027 3.8162 3.1809 4.3716 2.9595 3.8283 3.8734 4.1253 3.9080 3.8487 3.9595 3.9187 3.9215 3.8984 3.8639 3.8306 3.9068 3.9301 3.9138 1.0175 1.0245 1.0216 1.0204 1.0122 1.0154 1.0115 1.0099 1.0279 1.0185 1.0062 1.0086 1.0103 1.0485 1.0096 1.0146 1.0100 1.0066 1.0076 1.0147 1.0186 1.0073 1.0018 1.0103 0.9977 0.9947 1.0101 1.0083 0.9989 0.9937
dispcorr: -0.035788634 hartree
energy: -1195.612497019051
dipole: 14.43313 -13.97574 0.45739 19.62563 -17.51501 2.11062 -3.89425 3.22651 -0.66774
magnitude: 2.26049 au
magnitude: 5.74571 debye
