program: Orca
programVersion: 5.0.2
elementType: O O O O C C C C C C C C C C C C C C C C C C C C C C C H H H H H H H H H H H H H H H H H H H H H H H H H H H H H H
charge: 0
multiplicity: 1
keywords: wb97x-d3
keywords: def2-TZVPP
keywords: def2/J RIJCOSX
keywords: DEFGRID2
keywords: scfconv7
keywords: smallprint printgap noloewdin
keywords: NOSOSCF
formula: C23H30O4
InChI: InChI=1/C23H30O4/c1-14-11-15(2)18(16(3)12-14)19-20(26-17(24)13-22(4,5)6)23(27-21(19)25)9-7-8-10-23/h11-12H,7-10,13H2,1-6H3
57 atoms
O  -3.028286 -1.610802 0.114576
O  -0.960903 1.180147 -0.657411
O  -1.649506 -3.320549 0.526003
O  0.084262 1.561365 1.288498
C  -2.929027 -0.228297 -0.208013
C  -3.655673 0.596302 0.85275
C  -3.726825 0.071023 -1.477317
C  -5.133436 0.374149 0.523786
C  -5.188712 0.171415 -1.007487
C  -1.456481 -0.017742 -0.28649
C  -0.78377 -1.132693 -0.012518
C  -1.801973 -2.169649 0.250867
C  0.672213 -1.325805 0.001405
C  2.050842 3.356946 -0.080621
C  0.804065 2.730556 -0.718428
C  -0.001814 1.785361 0.123897
C  1.338131 -1.512519 1.219674
C  1.390591 -1.26479 -1.195631
C  2.709005 4.212894 -1.167434
C  1.683708 4.257655 1.099125
C  3.038482 2.273633 0.357818
C  2.721209 -1.607836 1.217273
C  2.777814 -1.369926 -1.152895
C  3.461038 -1.531623 0.042287
C  0.576869 -1.60086 2.508273
C  0.701104 -1.104454 -2.521554
C  4.957966 -1.626544 0.078786
H  -3.385047 1.647811 0.727054
H  -3.376336 0.304083 1.865188
H  -3.563402 -0.687146 -2.243614
H  -3.387301 1.024763 -1.88658
H  -5.751558 1.207343 0.857122
H  -5.496982 -0.515938 1.036944
H  -5.740532 -0.733875 -1.256786
H  -5.69781 0.995889 -1.506438
H  1.093103 2.18473 -1.622655
H  0.125199 3.519343 -1.065537
H  3.000024 3.611594 -2.031519
H  3.610516 4.693556 -0.784577
H  2.041522 5.002077 -1.521012
H  1.253601 3.697218 1.926474
H  2.572526 4.768702 1.473658
H  0.968077 5.028143 0.802189
H  3.288087 1.603052 -0.467409
H  3.967992 2.729846 0.703688
H  2.650815 1.660307 1.169498
H  3.237567 -1.740648 2.161861
H  3.335746 -1.328434 -2.081996
H  -0.000935 -2.524446 2.558561
H  1.251641 -1.586449 3.362982
H  -0.116576 -0.767448 2.620328
H  0.346542 -0.084588 -2.683536
H  1.37875 -1.34233 -3.340536
H  -0.164373 -1.761219 -2.60989
H  5.284318 -2.601566 0.443946
H  5.395072 -1.481726 -0.908353
H  5.385711 -0.874268 0.743074
totalener: -1195.57583081 hartree
nucrepener: 2708.55658977 hartree
electener: -3904.13242058 hartree
oneelecener: -7010.85711508 hartree
twoeener: 3106.72469450 hartree
kineticenergy: 1190.25558092 hartree
xcener: -117.208532182976 hartree
chargesum: -0.0000000
charge: -0.264867 -0.319835 -0.313840 -0.318443 0.353520 -0.195889 -0.195330 -0.139461 -0.135391 0.159154 -0.150694 0.309137 0.197779 0.229171 -0.257501 0.359429 -0.065426 -0.116772 -0.302406 -0.306944 -0.334465 -0.123268 -0.119679 -0.002100 -0.237467 -0.247268 -0.222003 0.079222 0.090230 0.087826 0.084979 0.076108 0.091183 0.084922 0.072475 0.105389 0.117898 0.089695 0.089734 0.088194 0.110870 0.087695 0.082065 0.085290 0.092800 0.111495 0.088698 0.085646 0.119532 0.076790 0.097958 0.085708 0.090701 0.109145 0.105603 0.078196 0.094813
qa: -0.2649 -0.3198 -0.3138 -0.3184 0.3535 -0.1959 -0.1953 -0.1395 -0.1354 0.1592 -0.1507 0.3091 0.1978 0.2292 -0.2575 0.3594 -0.0654 -0.1168 -0.3024 -0.3069 -0.3345 -0.1233 -0.1197 -0.0021 -0.2375 -0.2473 -0.2220 0.0792 0.0902 0.0878 0.0850 0.0761 0.0912 0.0849 0.0725 0.1054 0.1179 0.0897 0.0897 0.0882 0.1109 0.0877 0.0821 0.0853 0.0928 0.1115 0.0887 0.0856 0.1195 0.0768 0.0980 0.0857 0.0907 0.1091 0.1056 0.0782 0.0948
va: 2.1571 2.0901 2.2066 2.1634 3.7902 3.9846 3.9593 3.9086 3.9008 3.8580 3.2325 4.3601 3.0540 3.7802 3.9007 4.0891 3.8820 3.7844 3.9301 3.9184 3.9315 3.9173 3.8656 3.7893 3.9062 3.9321 3.9078 1.0201 1.0233 1.0221 1.0184 1.0121 1.0150 1.0112 1.0097 1.0174 1.0156 1.0064 1.0108 1.0075 1.0174 1.0074 1.0056 1.0052 1.0103 1.0104 1.0147 1.0187 1.0036 1.0099 1.0063 0.9959 1.0090 0.9982 0.9957 1.0093 0.9963
dispcorr: -0.035225416 hartree
energy: -1195.611056228928
dipole: 14.47231 -14.08773 0.38458 21.67786 -19.65411 2.02376 -3.17542 2.28707 -0.88835
magnitude: 2.24336 au
magnitude: 5.70216 debye
