program: Orca
programVersion: 5.0.2
elementType: O O O O C C C C C C C C C C C C C C C C C C C C C C C H H H H H H H H H H H H H H H H H H H H H H H H H H H H H H
charge: 0
multiplicity: 1
keywords: wb97x-d3
keywords: def2-TZVPP
keywords: def2/J RIJCOSX
keywords: DEFGRID2
keywords: scfconv7
keywords: smallprint printgap noloewdin
keywords: NOSOSCF
formula: C23H30O4
InChI: InChI=1/C23H30O4/c1-14-11-15(2)18(16(3)12-14)19-20(26-17(24)13-22(4,5)6)23(27-21(19)25)9-7-8-10-23/h11-12H,7-10,13H2,1-6H3
57 atoms
O  -2.974167 -1.77887 0.20359
O  -0.974314 1.032154 -0.641274
O  -1.563129 -3.463901 0.604468
O  0.097432 1.453625 1.282066
C  -2.907639 -0.397459 -0.131441
C  -3.574766 0.455789 0.962896
C  -3.719276 -0.112424 -1.421262
C  -4.997126 0.673636 0.460891
C  -4.784833 0.915848 -1.030367
C  -1.43787 -0.170303 -0.244462
C  -0.739358 -1.268936 0.026367
C  -1.736661 -2.317778 0.322526
C  0.719332 -1.43935 0.011405
C  1.900598 3.398753 -0.101211
C  0.732627 2.640304 -0.74338
C  -0.023033 1.673252 0.119582
C  1.408796 -1.630914 1.215801
C  1.4179 -1.352501 -1.196332
C  2.503907 4.275706 -1.202894
C  1.421087 4.299583 1.037642
C  2.972482 2.426511 0.396212
C  2.792455 -1.716251 1.188603
C  2.806491 -1.444045 -1.177923
C  3.511624 -1.62095 0.002624
C  0.673323 -1.735797 2.518043
C  0.707709 -1.182245 -2.510233
C  5.008297 -1.728157 0.008458
H  -3.067618 1.421324 1.036192
H  -3.49966 -0.023863 1.938322
H  -4.182049 -1.046697 -1.741243
H  -3.089286 0.227483 -2.243875
H  -5.500346 1.499585 0.964059
H  -5.599345 -0.224196 0.620328
H  -5.695571 0.814429 -1.620696
H  -4.40929 1.930109 -1.188755
H  1.098432 2.072166 -1.605982
H  0.005524 3.349204 -1.157452
H  3.345563 4.853298 -0.817472
H  1.773804 4.984585 -1.600302
H  2.87253 3.674994 -2.03733
H  1.02228 3.729348 1.874223
H  2.248518 4.902624 1.415676
H  0.646148 4.990916 0.697484
H  3.294248 1.749245 -0.398204
H  3.85173 2.977517 0.735417
H  2.625688 1.813953 1.226548
H  3.325604 -1.856794 2.12264
H  3.348193 -1.384044 -2.11562
H  -0.035059 -0.916767 2.64362
H  0.115822 -2.671092 2.578807
H  1.363717 -1.707511 3.359871
H  0.336905 -0.165389 -2.653021
H  1.377622 -1.398025 -3.341599
H  -0.149561 -1.849874 -2.597001
H  5.328849 -2.746638 0.234954
H  5.435873 -1.457715 -0.956253
H  5.451223 -1.076273 0.762211
totalener: -1195.57582812 hartree
nucrepener: 2705.26017538 hartree
electener: -3900.83600351 hartree
oneelecener: -7004.22016346 hartree
twoeener: 3103.38415996 hartree
kineticenergy: 1190.24783058 hartree
xcener: -117.205273128912 hartree
chargesum: -0.0000000
charge: -0.259540 -0.315150 -0.314528 -0.317762 0.427046 -0.204231 -0.205309 -0.123007 -0.138854 0.090837 -0.159198 0.318951 0.177955 0.217293 -0.253201 0.361832 -0.067198 -0.120343 -0.301837 -0.309386 -0.319474 -0.113647 -0.114604 -0.001918 -0.241651 -0.247523 -0.223406 0.089170 0.088766 0.102905 0.084595 0.074072 0.082276 0.077139 0.071185 0.104625 0.116655 0.089688 0.087503 0.090204 0.110779 0.088462 0.082567 0.082733 0.091283 0.110036 0.088557 0.085588 0.099181 0.120390 0.076785 0.083486 0.091112 0.110727 0.105618 0.078605 0.093158
qa: -0.2595 -0.3152 -0.3145 -0.3178 0.4270 -0.2042 -0.2053 -0.1230 -0.1389 0.0908 -0.1592 0.3190 0.1780 0.2173 -0.2532 0.3618 -0.0672 -0.1203 -0.3018 -0.3094 -0.3195 -0.1136 -0.1146 -0.0019 -0.2417 -0.2475 -0.2234 0.0892 0.0888 0.1029 0.0846 0.0741 0.0823 0.0771 0.0712 0.1046 0.1167 0.0897 0.0875 0.0902 0.1108 0.0885 0.0826 0.0827 0.0913 0.1100 0.0886 0.0856 0.0992 0.1204 0.0768 0.0835 0.0911 0.1107 0.1056 0.0786 0.0932
va: 2.1516 2.0966 2.2046 2.1610 3.6137 3.9420 3.9003 3.8999 3.9392 3.9704 3.2354 4.3406 3.0898 3.7869 3.8947 4.0891 3.8943 3.7898 3.9303 3.9179 3.9265 3.9255 3.8819 3.8082 3.9072 3.9279 3.9105 1.0188 1.0288 1.0203 1.0152 1.0155 1.0137 1.0172 1.0092 1.0163 1.0169 1.0109 1.0076 1.0062 1.0169 1.0074 1.0052 1.0068 1.0094 1.0132 1.0149 1.0183 1.0047 1.0035 1.0097 0.9963 1.0092 0.9980 0.9939 1.0085 0.9985
dispcorr: -0.034738764 hartree
energy: -1195.610566885437
dipole: 14.00731 -13.68618 0.32113 23.69992 -21.63699 2.06293 -3.71122 2.79526 -0.91596
magnitude: 2.27987 au
magnitude: 5.79496 debye
