program: Orca
programVersion: 5.0.2
elementType: Cl Cl O O O O C C C C C C C C C C C C C C C C C C C C C H H H H H H H H H H H H H H H H H H H H H H H H
charge: 0
multiplicity: 1
keywords: wb97x-d3
keywords: def2-TZVPP
keywords: def2/J RIJCOSX
keywords: DEFGRID2
keywords: scfconv7
keywords: smallprint printgap noloewdin
keywords: NOSOSCF
formula: C21H24Cl2O4
InChI: InChI=1/C21H24Cl2O4/c1-4-20(2,3)19(25)26-17-16(14-9-8-13(22)12-15(14)23)18(24)27-21(17)10-6-5-7-11-21/h8-9,12H,4-7,10-11H2,1-3H3
51 atoms
Cl 1.727302 1.35937 2.348246
Cl 5.399837 -0.438187 -1.116324
O  -1.946782 2.707465 0.468414
O  -1.392933 -0.676088 -0.510944
O  0.061734 3.664356 0.547465
O  -0.457947 -1.409791 1.380209
C  -2.529654 1.425098 0.170434
C  -3.463778 1.599972 -1.030042
C  -3.290521 0.949001 1.412117
C  -4.343927 0.381041 -1.283751
C  -4.187514 -0.256206 1.145679
C  -5.11984 -0.00967 -0.032852
C  -1.30398 0.611109 -0.128188
C  -0.190376 1.331219 -0.005424
C  -0.61103 2.682107 0.366542
C  -0.875182 -3.003989 -0.401864
C  1.188636 0.917996 -0.262127
C  -0.869632 -1.657816 0.283553
C  0.385637 -3.07211 -1.298326
C  -0.856415 -4.101094 0.659912
C  -2.11602 -3.180103 -1.281361
C  2.154269 0.895341 0.74102
C  1.562412 0.505513 -1.538287
C  1.725419 -3.041289 -0.578721
C  3.454271 0.487551 0.491382
C  2.852628 0.089784 -1.815272
C  3.786371 0.087327 -0.792718
H  -4.106927 2.456537 -0.808762
H  -2.880272 1.856688 -1.917136
H  -2.586486 0.744389 2.221811
H  -3.918034 1.784315 1.735684
H  -3.747626 -0.464779 -1.633783
H  -5.033435 0.620545 -2.095344
H  -4.766744 -0.454531 2.049364
H  -3.595782 -1.157167 0.967685
H  -5.820568 0.791753 0.222594
H  -5.720287 -0.900716 -0.226476
H  0.304404 -4.002515 -1.866735
H  0.342883 -2.26477 -2.034504
H  -0.782233 -5.072628 0.170537
H  -1.776714 -4.09527 1.245562
H  -0.020359 -4.016492 1.351519
H  -2.126604 -2.504277 -2.135995
H  -3.038293 -3.036074 -0.71609
H  -2.126205 -4.197877 -1.672569
H  0.828071 0.518293 -2.332826
H  1.863068 -2.141726 0.022598
H  1.855627 -3.902875 0.076172
H  2.536479 -3.065428 -1.306782
H  4.188581 0.47434 1.285048
H  3.120324 -0.228504 -2.812897
elementType: Cl O C H
totalener: -2036.17316266 hartree
nucrepener: 3063.69423869 hartree
electener: -5099.86740135 hartree
oneelecener: -8885.12456310 hartree
twoeener: 3785.25716174 hartree
cpcmener: -0.04152374 hartree
kineticenergy: 2029.97334432 hartree
xcener: -150.495596948949 hartree
chargesum: -0.0000000
charge: -0.065772 -0.081304 -0.306153 -0.298455 -0.453660 -0.410522 0.552568 -0.183804 -0.229138 -0.161351 -0.140977 -0.145755 0.049981 0.014197 0.374925 0.375722 -0.024582 0.247420 -0.175935 -0.353037 -0.374031 0.044517 -0.165092 -0.321205 -0.175870 -0.183422 0.139579 0.100064 0.100366 0.097188 0.101169 0.079787 0.085131 0.085701 0.072845 0.077200 0.081301 0.100606 0.098857 0.110095 0.114972 0.098741 0.103924 0.112657 0.114042 0.159449 0.076818 0.107376 0.101308 0.125689 0.145868
qa: -0.0658 -0.0813 -0.3062 -0.2985 -0.4537 -0.4105 0.5526 -0.1838 -0.2291 -0.1614 -0.1410 -0.1458 0.0500 0.0142 0.3749 0.3757 -0.0246 0.2474 -0.1759 -0.3530 -0.3740 0.0445 -0.1651 -0.3212 -0.1759 -0.1834 0.1396 0.1001 0.1004 0.0972 0.1012 0.0798 0.0851 0.0857 0.0728 0.0772 0.0813 0.1006 0.0989 0.1101 0.1150 0.0987 0.1039 0.1127 0.1140 0.1594 0.0768 0.1074 0.1013 0.1257 0.1459
va: 1.2579 1.2203 2.1275 2.1491 2.0557 2.0862 3.5811 3.9397 3.9696 3.9151 3.9127 3.8971 4.0639 3.3843 4.3270 3.6122 3.3978 4.2007 3.8434 3.9523 3.9342 3.9393 3.8916 3.9635 4.0928 3.9740 3.8130 1.0120 1.0128 1.0219 1.0133 1.0107 1.0148 1.0131 1.0132 1.0088 1.0102 1.0044 1.0066 0.9996 1.0013 1.0062 1.0047 1.0022 1.0046 1.0001 0.9971 1.0023 1.0004 1.0258 1.0078
dispcorr: -0.035918857 hartree
energy: -2036.209081517245
dipole: -44.51884 42.31753 -2.20130 -31.06664 27.78811 -3.27853 -11.27074 9.01082 -2.25992
magnitude: 4.54992 au
magnitude: 11.56497 debye
