program: Orca
programVersion: 5.0.2
elementType: Cl Cl O O O O C C C C C C C C C C C C C C C C C C C C C H H H H H H H H H H H H H H H H H H H H H H H H
charge: 0
multiplicity: 1
keywords: wb97x-d3
keywords: def2-TZVPP
keywords: def2/J RIJCOSX
keywords: DEFGRID2
keywords: scfconv7
keywords: smallprint printgap noloewdin
keywords: NOSOSCF
formula: C21H24Cl2O4
InChI: InChI=1/C21H24Cl2O4/c1-4-20(2,3)19(25)26-17-16(14-9-8-13(22)12-15(14)23)18(24)27-21(17)10-6-5-7-11-21/h8-9,12H,4-7,10-11H2,1-3H3
51 atoms
Cl 1.387668 1.601718 2.484169
Cl 5.774824 0.253708 -0.271511
O  -2.106652 2.253983 0.103689
O  -1.057176 -1.034861 -0.70064
O  -0.268757 3.483425 0.356578
O  0.258959 -1.664358 0.995443
C  -2.456707 0.896738 -0.20971
C  -3.247851 0.87777 -1.516634
C  -3.262325 0.305475 0.947463
C  -4.606599 1.551774 -1.363061
C  -4.624438 0.976357 1.087699
C  -5.40557 0.936723 -0.220164
C  -1.112592 0.252072 -0.333972
C  -0.1280 1.119466 -0.091596
C  -0.776408 2.409429 0.157518
C  -0.238736 -3.260076 -0.772963
C  1.319797 0.923284 -0.132236
C  -0.279233 -1.942986 -0.035169
C  -1.672482 -3.772563 -1.015341
C  0.453104 -3.028226 -2.124387
C  0.573671 -4.262473 0.040979
C  2.116924 1.133529 0.990607
C  1.939776 0.484788 -1.299049
C  -2.515607 -3.960735 0.236805
C  3.487192 0.938052 0.959496
C  3.30593 0.268431 -1.355453
C  4.066444 0.506197 -0.222552
H  -2.658858 1.351226 -2.305564
H  -3.391086 -0.166364 -1.807311
H  -3.400159 -0.761195 0.749421
H  -2.686009 0.387334 1.871997
H  -5.153416 1.456026 -2.302884
H  -4.475823 2.623609 -1.19096
H  -4.498343 2.012829 1.412537
H  -5.183199 0.472903 1.878809
H  -6.356879 1.459581 -0.103077
H  -5.646867 -0.1025 -0.466516
H  -2.188364 -3.102313 -1.706121
H  -1.577732 -4.727877 -1.537774
H  -0.108755 -2.353975 -2.770342
H  0.544025 -3.983543 -2.642562
H  1.459028 -2.624521 -1.997158
H  0.578267 -5.222328 -0.476453
H  0.167087 -4.42632 1.038364
H  1.610496 -3.9433 0.149838
H  1.339787 0.312935 -2.18302
H  -2.647747 -3.030413 0.79384
H  -3.511977 -4.312117 -0.031832
H  -2.085427 -4.696445 0.916264
H  4.087469 1.107084 1.842571
H  3.765402 -0.073105 -2.272334
elementType: Cl O C H
totalener: -2036.17630377 hartree
nucrepener: 3002.74193136 hartree
electener: -5038.91823513 hartree
oneelecener: -8763.49876124 hartree
twoeener: 3724.58052611 hartree
cpcmener: -0.04196915 hartree
kineticenergy: 2029.98583601 hartree
xcener: -150.497030718783 hartree
chargesum: -0.0000000
charge: -0.066939 -0.081648 -0.325294 -0.296276 -0.454094 -0.401752 0.510185 -0.210968 -0.223046 -0.155336 -0.154492 -0.125976 0.181991 0.028057 0.354606 0.314995 -0.073299 0.270171 -0.162142 -0.360088 -0.344612 0.044658 -0.150581 -0.293153 -0.183237 -0.181290 0.140629 0.101410 0.094621 0.093186 0.102366 0.080029 0.078034 0.079630 0.079702 0.080762 0.069430 0.084040 0.086574 0.109377 0.112865 0.108705 0.107990 0.105355 0.107828 0.163036 0.083446 0.100415 0.096435 0.125280 0.148417
qa: -0.0669 -0.0816 -0.3253 -0.2963 -0.4541 -0.4018 0.5102 -0.2110 -0.2230 -0.1553 -0.1545 -0.1260 0.1820 0.0281 0.3546 0.3150 -0.0733 0.2702 -0.1621 -0.3601 -0.3446 0.0447 -0.1506 -0.2932 -0.1832 -0.1813 0.1406 0.1014 0.0946 0.0932 0.1024 0.0800 0.0780 0.0796 0.0797 0.0808 0.0694 0.0840 0.0866 0.1094 0.1129 0.1087 0.1080 0.1054 0.1078 0.1630 0.0834 0.1004 0.0964 0.1253 0.1484
va: 1.2578 1.2215 2.1080 2.1707 2.0580 2.0990 3.5880 3.9955 4.0190 3.9128 3.9147 3.8733 3.8863 3.3265 4.3459 3.6761 3.4117 4.1755 3.8675 3.9304 3.9445 3.9345 3.9007 3.9513 4.1118 4.0280 3.8397 1.0118 1.0127 1.0141 1.0169 1.0135 1.0148 1.0148 1.0132 1.0096 1.0089 1.0126 1.0070 1.0083 1.0024 1.0033 1.0018 1.0024 1.0048 0.9963 0.9995 1.0029 1.0007 1.0259 1.0057
dispcorr: -0.032364036 hartree
energy: -2036.208667807033
dipole: -49.27008 47.39224 -1.87785 -32.88298 29.30379 -3.57919 -15.38091 13.07181 -2.30910
magnitude: 4.65498 au
magnitude: 11.83202 debye
