program: Orca
programVersion: 5.0.2
elementType: Cl Cl O O O O C C C C C C C C C C C C C C C C C C C C C H H H H H H H H H H H H H H H H H H H H H H H H
charge: 0
multiplicity: 1
keywords: wb97x-d3
keywords: def2-TZVPP
keywords: def2/J RIJCOSX
keywords: DEFGRID2
keywords: scfconv7
keywords: smallprint printgap noloewdin
keywords: NOSOSCF
formula: C21H24Cl2O4
InChI: InChI=1/C21H24Cl2O4/c1-4-20(2,3)19(25)26-17-16(14-9-8-13(22)12-15(14)23)18(24)27-21(17)10-6-5-7-11-21/h8-9,12H,4-7,10-11H2,1-3H3
51 atoms
Cl 0.789265 -0.089434 -2.553224
Cl 5.68871 0.188992 -0.42287
O  -2.066902 2.492098 0.29738
O  -1.194878 -0.937928 -0.073223
O  -0.160595 3.641749 0.260177
O  -0.172617 -1.20922 1.894288
C  -2.49918 1.122661 0.222968
C  -3.419936 0.954176 -0.984439
C  -3.20354 0.751308 1.528045
C  -4.732469 1.708569 -0.804755
C  -4.518366 1.506217 1.693669
C  -5.431048 1.309327 0.489569
C  -1.200459 0.400576 0.05568
C  -0.169081 1.24222 0.030945
C  -0.734785 2.583722 0.204566
C  -0.625314 -3.170439 0.534879
C  1.262053 0.979504 -0.106258
C  -0.62351 -1.706064 0.902408
C  0.53683 -3.405288 -0.459658
C  -0.439487 -4.001895 1.801352
C  -1.943267 -3.56608 -0.137647
C  1.805841 0.364605 -1.231994
C  2.131589 1.353187 0.916101
C  1.934095 -3.096485 0.058058
C  3.164539 0.114077 -1.339901
C  3.49145 1.117167 0.833332
C  3.993283 0.49518 -0.298975
H  -2.897297 1.278472 -1.887331
H  -3.626783 -0.113015 -1.10041
H  -3.402618 -0.32378 1.505997
H  -2.533806 0.936342 2.370849
H  -5.375041 1.503078 -1.662761
H  -4.548266 2.786442 -0.809245
H  -4.321261 2.571874 1.839251
H  -5.00963 1.157902 2.60402
H  -6.347782 1.888591 0.616046
H  -5.730701 0.257912 0.430241
H  0.483362 -4.458249 -0.749142
H  0.347302 -2.831998 -1.370125
H  -1.284935 -3.88127 2.480064
H  0.467946 -3.753655 2.349263
H  -0.381868 -5.056649 1.530094
H  -1.944537 -4.644227 -0.300408
H  -2.080841 -3.090616 -1.108123
H  -2.804283 -3.326261 0.488155
H  1.731818 1.827717 1.802425
H  2.208578 -3.731911 0.900134
H  2.666428 -3.272277 -0.730314
H  2.050335 -2.058481 0.373503
H  3.566073 -0.367313 -2.22078
H  4.145707 1.412436 1.641515
elementType: Cl O C H
totalener: -2036.17543281 hartree
nucrepener: 3032.86898219 hartree
electener: -5069.04441500 hartree
oneelecener: -8823.46517734 hartree
twoeener: 3754.42076235 hartree
cpcmener: -0.03603126 hartree
kineticenergy: 2029.98102914 hartree
xcener: -150.496839723308 hartree
chargesum: -0.0000000
charge: -0.072607 -0.079914 -0.324099 -0.297687 -0.459843 -0.418137 0.543002 -0.212304 -0.233021 -0.151736 -0.153200 -0.128977 0.084212 0.099407 0.352514 0.339944 -0.033247 0.292179 -0.190784 -0.351371 -0.345451 0.021371 -0.138462 -0.290090 -0.202680 -0.193511 0.157798 0.096016 0.094131 0.098311 0.102228 0.079988 0.078256 0.077576 0.080303 0.081062 0.070083 0.097981 0.091180 0.114185 0.099413 0.108364 0.107089 0.098745 0.112586 0.155249 0.103205 0.103831 0.064306 0.124811 0.147795
qa: -0.0726 -0.0799 -0.3241 -0.2977 -0.4598 -0.4181 0.5430 -0.2123 -0.2330 -0.1517 -0.1532 -0.1290 0.0842 0.0994 0.3525 0.3399 -0.0332 0.2922 -0.1908 -0.3514 -0.3455 0.0214 -0.1385 -0.2901 -0.2027 -0.1935 0.1578 0.0960 0.0941 0.0983 0.1022 0.0800 0.0783 0.0776 0.0803 0.0811 0.0701 0.0980 0.0912 0.1142 0.0994 0.1084 0.1071 0.0987 0.1126 0.1552 0.1032 0.1038 0.0643 0.1248 0.1478
va: 1.2476 1.2231 2.1191 2.1628 2.0550 2.0739 3.5563 3.9887 4.0047 3.9090 3.9144 3.8714 3.9674 3.3064 4.3510 3.6569 3.4280 4.1544 3.8512 3.9485 3.9320 3.8909 3.9374 3.9491 4.0648 4.0353 3.8125 1.0155 1.0128 1.0117 1.0185 1.0132 1.0148 1.0152 1.0129 1.0096 1.0090 1.0081 1.0215 1.0028 1.0057 1.0000 1.0017 1.0100 1.0046 1.0037 1.0011 1.0022 1.0037 1.0263 1.0063
dispcorr: -0.034048450 hartree
energy: -2036.209481254943
dipole: -41.34931 39.62150 -1.72782 -24.11274 20.93826 -3.17449 13.02049 -13.27846 -0.25797
magnitude: 3.62343 au
magnitude: 9.21003 debye
