program: Orca
programVersion: 5.0.2
elementType: Cl Cl O O O O C C C C C C C C C C C C C C C C C C C C C H H H H H H H H H H H H H H H H H H H H H H H H
charge: 0
multiplicity: 1
keywords: wb97x-d3
keywords: def2-TZVPP
keywords: def2/J RIJCOSX
keywords: DEFGRID2
keywords: scfconv7
keywords: smallprint printgap noloewdin
keywords: NOSOSCF
formula: C21H24Cl2O4
InChI: InChI=1/C21H24Cl2O4/c1-4-20(2,3)19(25)26-17-16(14-9-8-13(22)12-15(14)23)18(24)27-21(17)10-6-5-7-11-21/h8-9,12H,4-7,10-11H2,1-3H3
51 atoms
Cl 1.435523 1.942913 -2.142603
Cl 5.736802 0.094277 0.456611
O  -2.117167 2.272868 0.271324
O  -1.0891 -1.109788 0.542534
O  -0.272733 3.517289 0.233779
O  0.239173 -1.437535 -1.22431
C  -2.476032 0.887352 0.352435
C  -3.264101 0.499053 -0.89901
C  -3.290816 0.656942 1.624527
C  -4.621825 1.191792 -0.951045
C  -4.647496 1.350571 1.561107
C  -5.427656 0.940595 0.317588
C  -1.136281 0.222483 0.391008
C  -0.145305 1.110161 0.309085
C  -0.785364 2.431458 0.257693
C  -0.254958 -3.333686 0.187796
C  1.299313 0.887366 0.343045
C  -0.310233 -1.888864 -0.264106
C  -0.7681 -4.2078 -0.974399
C  1.225464 -3.655758 0.4371
C  -1.047048 -3.600755 1.465533
C  2.122873 1.240681 -0.723663
C  1.887481 0.268302 1.442385
C  -2.197761 -3.933381 -1.41681
C  3.487774 1.008861 -0.698015
C  3.24759 0.014364 1.489933
C  4.035575 0.394624 0.416321
H  -2.670831 0.727907 -1.787866
H  -3.409113 -0.585018 -0.883962
H  -3.438017 -0.420332 1.741398
H  -2.71674 0.995624 2.490657
H  -5.167071 0.829221 -1.824838
H  -4.486404 2.266964 -1.098481
H  -4.512841 2.435784 1.574184
H  -5.211505 1.101724 2.462395
H  -6.373578 1.484774 0.273197
H  -5.682772 -0.122522 0.382178
H  -0.0961 -4.094766 -1.828517
H  -0.678208 -5.248754 -0.652368
H  1.323252 -4.700533 0.735259
H  1.641862 -3.042429 1.238409
H  1.831576 -3.505031 -0.456176
H  -0.961585 -4.658749 1.718419
H  -2.108839 -3.374197 1.371814
H  -0.657264 -3.034856 2.312719
H  1.267218 -0.016658 2.282498
H  -2.480197 -4.616058 -2.218966
H  -2.916938 -4.071731 -0.609048
H  -2.323409 -2.920252 -1.805803
H  4.10884 1.292255 -1.536681
H  3.682084 -0.468338 2.354385
elementType: Cl O C H
totalener: -2036.18757477 hartree
nucrepener: 3000.78988120 hartree
electener: -5036.97745597 hartree
oneelecener: -8759.66625703 hartree
twoeener: 3722.68880106 hartree
cpcmener: -0.03320997 hartree
kineticenergy: 2029.97835337 hartree
xcener: -150.492201255976 hartree
chargesum: 0.0000000
charge: -0.064866 -0.080429 -0.315606 -0.281816 -0.418205 -0.385689 0.514757 -0.225353 -0.213313 -0.152418 -0.153908 -0.128223 0.173440 0.023593 0.336634 0.300574 -0.069757 0.231884 -0.158139 -0.333436 -0.354144 0.052988 -0.144513 -0.284387 -0.183181 -0.195284 0.146737 0.101827 0.088189 0.091432 0.100362 0.079467 0.079699 0.079876 0.079345 0.081489 0.068750 0.086524 0.085904 0.108379 0.107062 0.107435 0.107552 0.103237 0.109206 0.155091 0.102255 0.088701 0.081122 0.123875 0.145285
qa: -0.0649 -0.0804 -0.3156 -0.2818 -0.4182 -0.3857 0.5148 -0.2254 -0.2133 -0.1524 -0.1539 -0.1282 0.1734 0.0236 0.3366 0.3006 -0.0698 0.2319 -0.1581 -0.3334 -0.3541 0.0530 -0.1445 -0.2844 -0.1832 -0.1953 0.1467 0.1018 0.0882 0.0914 0.1004 0.0795 0.0797 0.0799 0.0793 0.0815 0.0688 0.0865 0.0859 0.1084 0.1071 0.1074 0.1076 0.1032 0.1092 0.1551 0.1023 0.0887 0.0811 0.1239 0.1453
va: 1.2586 1.2229 2.1160 2.1512 2.1022 2.1279 3.5881 4.0126 3.9932 3.9141 3.9115 3.8715 3.8748 3.3382 4.3659 3.6622 3.4382 4.2092 3.8645 3.9254 3.9614 3.9366 3.8911 3.9451 4.1150 4.0244 3.8362 1.0175 1.0139 1.0130 1.0122 1.0130 1.0151 1.0148 1.0132 1.0098 1.0091 1.0169 1.0077 1.0027 1.0035 1.0133 1.0014 1.0018 1.0047 1.0018 1.0042 0.9998 1.0050 1.0263 1.0067
dispcorr: -0.032180120 hartree
energy: -2036.219754891429
dipole: -49.26361 47.49283 -1.77078 -34.33736 30.69810 -3.63926 8.12138 -6.69256 1.42883
magnitude: 4.29202 au
magnitude: 10.90944 debye
