program: Orca
programVersion: 5.0.2
elementType: Cl Cl O O O O C C C C C C C C C C C C C C C C C C C C C H H H H H H H H H H H H H H H H H H H H H H H H
charge: 0
multiplicity: 1
keywords: wb97x-d3
keywords: def2-TZVPP
keywords: def2/J RIJCOSX
keywords: DEFGRID2
keywords: scfconv7
keywords: smallprint printgap noloewdin
keywords: NOSOSCF
formula: C21H24Cl2O4
InChI: InChI=1/C21H24Cl2O4/c1-4-20(2,3)19(25)26-17-16(14-9-8-13(22)12-15(14)23)18(24)27-21(17)10-6-5-7-11-21/h8-9,12H,4-7,10-11H2,1-3H3
51 atoms
Cl 1.369961 1.563634 2.489533
Cl 5.779201 0.276163 -0.262535
O  -2.106062 2.251082 0.099041
O  -1.061751 -1.03979 -0.7059
O  -0.265942 3.475466 0.364593
O  0.269876 -1.661102 0.981755
C  -2.456172 0.897916 -0.216374
C  -3.249451 0.883628 -1.522744
C  -3.263456 0.306821 0.940353
C  -4.60525 1.563434 -1.366708
C  -4.622588 0.983483 1.084618
C  -5.406559 0.953554 -0.222251
C  -1.112685 0.249296 -0.342515
C  -0.128435 1.115241 -0.099299
C  -0.775661 2.408043 0.156748
C  -0.241847 -3.267113 -0.772411
C  1.319635 0.921687 -0.135226
C  -0.27831 -1.944752 -0.039685
C  -1.675063 -3.785657 -1.004003
C  0.440748 -3.040295 -2.129619
C  0.578198 -4.2626 0.042908
C  2.109516 1.119971 0.994897
C  1.947609 0.504533 -1.305071
C  -2.507288 -3.987581 0.253672
C  3.480919 0.931441 0.966862
C  3.3153 0.296156 -1.358192
C  4.069073 0.519643 -0.21803
H  -2.660043 1.358318 -2.311225
H  -3.397134 -0.15834 -1.819491
H  -3.406192 -0.759614 0.743754
H  -2.686108 0.385744 1.864937
H  -5.154873 1.470349 -2.305619
H  -4.468461 2.635022 -1.196236
H  -4.490619 2.017893 1.414553
H  -5.183686 0.480036 1.874605
H  -6.352545 1.4860 -0.101805
H  -5.661564 -0.082497 -0.469661
H  -2.201483 -3.114553 -1.68638
H  -1.583233 -4.737331 -1.534389
H  -0.126127 -2.369301 -2.775512
H  0.531419 -3.995964 -2.648052
H  1.447164 -2.634159 -2.012115
H  0.581009 -5.228845 -0.463529
H  0.181591 -4.417061 1.046128
H  1.616031 -3.942177 0.142346
H  1.352878 0.3462 -2.195392
H  -2.624257 -3.066889 0.830479
H  -3.510582 -4.32426 -0.010127
H  -2.078972 -4.740225 0.916176
H  4.076169 1.091767 1.855208
H  3.782217 -0.028759 -2.277769
elementType: Cl O C H
totalener: -2036.18884711 hartree
nucrepener: 3001.89829631 hartree
electener: -5038.08714342 hartree
oneelecener: -8761.82415638 hartree
twoeener: 3723.73701296 hartree
cpcmener: -0.03334366 hartree
kineticenergy: 2029.98021249 hartree
xcener: -150.493263169680 hartree
chargesum: 0.0000000
charge: -0.065035 -0.081079 -0.317081 -0.300154 -0.418570 -0.371093 0.507394 -0.212530 -0.224593 -0.154690 -0.153884 -0.126466 0.169041 0.034190 0.332761 0.313378 -0.067247 0.246557 -0.164142 -0.359254 -0.340559 0.050678 -0.152018 -0.290859 -0.184664 -0.182745 0.140002 0.099719 0.092178 0.088655 0.102724 0.079061 0.079395 0.080980 0.078961 0.080833 0.068301 0.083690 0.085663 0.108121 0.111385 0.108233 0.106621 0.104438 0.107193 0.158997 0.082576 0.100196 0.095823 0.123474 0.145446
qa: -0.0650 -0.0811 -0.3171 -0.3002 -0.4186 -0.3711 0.5074 -0.2125 -0.2246 -0.1547 -0.1539 -0.1265 0.1690 0.0342 0.3328 0.3134 -0.0672 0.2466 -0.1641 -0.3593 -0.3406 0.0507 -0.1520 -0.2909 -0.1847 -0.1827 0.1400 0.0997 0.0922 0.0887 0.1027 0.0791 0.0794 0.0810 0.0790 0.0808 0.0683 0.0837 0.0857 0.1081 0.1114 0.1082 0.1066 0.1044 0.1072 0.1590 0.0826 0.1002 0.0958 0.1235 0.1454
va: 1.2589 1.2222 2.1151 2.1624 2.1023 2.1347 3.5936 3.9930 4.0155 3.9133 3.9148 3.8724 3.8878 3.3115 4.3708 3.6707 3.4192 4.2046 3.8670 3.9299 3.9475 3.9364 3.8992 3.9519 4.1147 4.0314 3.8452 1.0123 1.0130 1.0149 1.0173 1.0133 1.0150 1.0150 1.0132 1.0099 1.0089 1.0126 1.0072 1.0084 1.0030 1.0038 1.0016 1.0029 1.0055 0.9978 1.0005 1.0029 1.0009 1.0265 1.0068
dispcorr: -0.032292901 hartree
energy: -2036.221140012272
dipole: -49.23637 47.44411 -1.79226 -32.82114 29.47350 -3.34765 -15.38227 13.26054 -2.12174
magnitude: 4.34979 au
magnitude: 11.05629 debye
