program: Orca
programVersion: 5.0.2
elementType: Cl Cl O O O O C C C C C C C C C C C C C C C C C C C C C H H H H H H H H H H H H H H H H H H H H H H H H
charge: 0
multiplicity: 1
keywords: wb97x-d3
keywords: def2-TZVPP
keywords: def2/J RIJCOSX
keywords: DEFGRID2
keywords: scfconv7
keywords: smallprint printgap noloewdin
keywords: NOSOSCF
formula: C21H24Cl2O4
InChI: InChI=1/C21H24Cl2O4/c1-4-20(2,3)19(25)26-17-16(14-9-8-13(22)12-15(14)23)18(24)27-21(17)10-6-5-7-11-21/h8-9,12H,4-7,10-11H2,1-3H3
51 atoms
Cl 1.174093 -0.258201 2.231506
Cl 5.871851 0.852969 -0.072519
O  -2.074981 2.451045 -0.107426
O  -1.07537 -0.933011 0.056049
O  -0.244154 3.70841 -0.174236
O  0.603455 -1.263848 -1.383265
C  -2.418527 1.063156 -0.034567
C  -3.245361 0.689996 -1.264867
C  -3.191599 0.813466 1.260926
C  -4.606501 1.378746 -1.263096
C  -4.550049 1.506606 1.249372
C  -5.369225 1.107253 0.02781
C  -1.072789 0.401443 -0.033227
C  -0.086551 1.304384 -0.078393
C  -0.747818 2.617517 -0.130043
C  -0.448977 -3.194218 -0.342428
C  1.369942 1.184904 -0.052256
C  -0.19773 -1.727648 -0.629461
C  -1.856881 -3.528121 -0.899165
C  0.631909 -4.008906 -1.04783
C  -0.379754 -3.448614 1.167892
C  2.050816 0.486461 0.94191
C  2.132806 1.804675 -1.040855
C  -2.216375 -5.006067 -0.872585
C  3.431916 0.374718 0.947179
C  3.512174 1.711744 -1.060147
C  4.149414 0.990386 -0.06327
H  -2.683029 0.933868 -2.16976
H  -3.3882 -0.394024 -1.262047
H  -3.334742 -0.26505 1.370317
H  -2.588859 1.142192 2.111413
H  -5.178816 1.025867 -2.123507
H  -4.480378 2.456441 -1.400419
H  -4.415926 2.591901 1.267836
H  -5.084095 1.249329 2.166389
H  -6.319219 1.646145 0.02131
H  -5.615735 0.041807 0.087721
H  -2.607507 -2.975494 -0.329582
H  -1.925859 -3.171447 -1.931705
H  0.521074 -5.065285 -0.805382
H  1.630455 -3.710364 -0.726308
H  0.582202 -3.91137 -2.1331
H  0.591371 -3.164241 1.574126
H  -0.510552 -4.512193 1.367096
H  -1.151734 -2.914113 1.721126
H  1.634809 2.35344 -1.828872
H  -2.162809 -5.429925 0.130801
H  -3.241244 -5.138146 -1.221955
H  -1.577116 -5.601325 -1.524386
H  3.934879 -0.178434 1.728148
H  4.078754 2.193709 -1.844791
elementType: Cl O C H
totalener: -2036.18687799 hartree
nucrepener: 2997.09382436 hartree
electener: -5033.28070236 hartree
oneelecener: -8752.14393460 hartree
twoeener: 3718.86323225 hartree
cpcmener: -0.02911179 hartree
kineticenergy: 2029.97562007 hartree
xcener: -150.495264554380 hartree
chargesum: -0.0000000
charge: -0.073925 -0.081621 -0.318807 -0.289309 -0.429951 -0.371520 0.496084 -0.222881 -0.215828 -0.151007 -0.154661 -0.127548 0.150498 0.084290 0.333171 0.318620 -0.091265 0.278653 -0.168535 -0.351193 -0.369691 0.069378 -0.121622 -0.302815 -0.180921 -0.210175 0.144721 0.101635 0.092433 0.092388 0.095772 0.079540 0.079152 0.079370 0.079587 0.081651 0.068771 0.080984 0.097090 0.103428 0.109896 0.107488 0.098075 0.109034 0.110016 0.147249 0.087506 0.099455 0.088826 0.124352 0.144165
qa: -0.0739 -0.0816 -0.3188 -0.2893 -0.4300 -0.3715 0.4961 -0.2229 -0.2158 -0.1510 -0.1547 -0.1275 0.1505 0.0843 0.3332 0.3186 -0.0913 0.2787 -0.1685 -0.3512 -0.3697 0.0694 -0.1216 -0.3028 -0.1809 -0.2102 0.1447 0.1016 0.0924 0.0924 0.0958 0.0795 0.0792 0.0794 0.0796 0.0817 0.0688 0.0810 0.0971 0.1034 0.1099 0.1075 0.0981 0.1090 0.1100 0.1472 0.0875 0.0995 0.0888 0.1244 0.1442
va: 1.2560 1.2215 2.1242 2.1679 2.0927 2.1233 3.6258 3.9972 3.9877 3.9118 3.9137 3.8683 3.8758 3.2618 4.3627 3.6419 3.4345 4.1800 3.8729 3.9589 3.9493 3.9242 3.9440 3.9503 4.1075 4.0542 3.8418 1.0157 1.0123 1.0143 1.0156 1.0131 1.0154 1.0152 1.0131 1.0099 1.0092 1.0125 1.0056 0.9959 1.0061 1.0041 1.0146 1.0021 1.0051 1.0071 0.9984 1.0025 0.9971 1.0250 1.0077
dispcorr: -0.031811463 hartree
energy: -2036.218689457926
dipole: -50.31019 48.24658 -2.06361 -30.19655 27.15229 -3.04426 -8.62886 8.66671 0.03784
magnitude: 3.67797 au
magnitude: 9.34865 debye
