program: Orca
programVersion: 5.0.2
elementType: Cl Cl O O O O C C C C C C C C C C C C C C C C C C C C C H H H H H H H H H H H H H H H H H H H H H H H H
charge: 0
multiplicity: 1
keywords: wb97x-d3
keywords: def2-TZVPP
keywords: def2/J RIJCOSX
keywords: DEFGRID2
keywords: scfconv7
keywords: smallprint printgap noloewdin
keywords: NOSOSCF
formula: C21H24Cl2O4
InChI: InChI=1/C21H24Cl2O4/c1-4-20(2,3)19(25)26-17-16(14-9-8-13(22)12-15(14)23)18(24)27-21(17)10-6-5-7-11-21/h8-9,12H,4-7,10-11H2,1-3H3
51 atoms
Cl 1.065682 -0.257895 2.22601
Cl 5.746877 0.491459 -0.258603
O  -2.11133 2.472365 -0.028911
O  -1.220773 -0.953259 -0.00322
O  -0.234966 3.655504 -0.182182
O  0.223141 -1.248143 -1.686842
C  -2.507844 1.096316 0.045699
C  -3.433351 0.779891 -1.127735
C  -3.198381 0.855338 1.389145
C  -4.758336 1.528242 -1.019673
C  -4.521635 1.6073 1.484923
C  -5.440475 1.266532 0.317802
C  -1.192353 0.384007 -0.049493
C  -0.176108 1.247961 -0.11807
C  -0.781149 2.586106 -0.118723
C  -0.72003 -3.204537 -0.592393
C  1.271453 1.051229 -0.139011
C  -0.483716 -1.732353 -0.855383
C  -0.027966 -3.593416 0.733664
C  -2.223744 -3.481963 -0.469334
C  -0.158128 -4.009629 -1.761261
C  1.942053 0.368315 0.872974
C  2.033845 1.580707 -1.177947
C  1.492418 -3.535547 0.728028
C  3.315733 0.185384 0.846805
C  3.405974 1.417517 -1.227632
C  4.03359 0.713866 -0.212043
H  -2.925815 1.011554 -2.067445
H  -3.624304 -0.296866 -1.126074
H  -3.381788 -0.217778 1.490641
H  -2.522921 1.13989 2.19994
H  -5.405163 1.21763 -1.842814
H  -4.593294 2.601723 -1.148602
H  -4.338147 2.685133 1.510757
H  -5.001258 1.356159 2.433243
H  -6.364191 1.845263 0.386919
H  -5.728804 0.211596 0.378477
H  -0.421022 -2.972123 1.541765
H  -0.345144 -4.614915 0.961822
H  -2.664886 -3.03452 0.42097
H  -2.378973 -4.559559 -0.402293
H  -2.774948 -3.126292 -1.341683
H  -0.691952 -3.79036 -2.687262
H  -0.279207 -5.074593 -1.557197
H  0.9008 -3.82558 -1.936498
H  1.540098 2.116933 -1.977496
H  1.925133 -4.295199 0.076917
H  1.882435 -2.568389 0.407094
H  1.876352 -3.718207 1.732415
H  3.81272 -0.352462 1.642131
H  3.97343 1.831741 -2.049486
elementType: Cl O C H
totalener: -2036.18770443 hartree
nucrepener: 3025.45511376 hartree
electener: -5061.64281818 hartree
oneelecener: -8808.86674784 hartree
twoeener: 3747.22392966 hartree
cpcmener: -0.02930841 hartree
kineticenergy: 2029.97304625 hartree
xcener: -150.493939754162 hartree
chargesum: -0.0000000
charge: -0.073391 -0.080616 -0.318720 -0.292261 -0.429779 -0.377095 0.512921 -0.218198 -0.217660 -0.150554 -0.153487 -0.127567 0.128310 0.087588 0.333495 0.334185 -0.047515 0.267097 -0.191212 -0.356168 -0.349059 0.009731 -0.138962 -0.300587 -0.173682 -0.196599 0.145848 0.100636 0.089551 0.093452 0.094787 0.079234 0.079007 0.078879 0.079448 0.081397 0.068661 0.094606 0.092851 0.103154 0.107297 0.112710 0.111126 0.107656 0.101776 0.147561 0.098924 0.075925 0.104860 0.125442 0.144997
qa: -0.0734 -0.0806 -0.3187 -0.2923 -0.4298 -0.3771 0.5129 -0.2182 -0.2177 -0.1506 -0.1535 -0.1276 0.1283 0.0876 0.3335 0.3342 -0.0475 0.2671 -0.1912 -0.3562 -0.3491 0.0097 -0.1390 -0.3006 -0.1737 -0.1966 0.1458 0.1006 0.0896 0.0935 0.0948 0.0792 0.0790 0.0789 0.0794 0.0814 0.0687 0.0946 0.0929 0.1032 0.1073 0.1127 0.1111 0.1077 0.1018 0.1476 0.0989 0.0759 0.1049 0.1254 0.1450
va: 1.2515 1.2235 2.1241 2.1696 2.0935 2.1178 3.5911 3.9957 3.9906 3.9114 3.9136 3.8684 3.8933 3.2543 4.3670 3.6213 3.4024 4.1943 3.8444 3.9369 3.9519 3.9395 3.9501 3.9559 4.0605 4.0364 3.8375 1.0164 1.0139 1.0127 1.0164 1.0132 1.0153 1.0156 1.0130 1.0098 1.0092 1.0151 1.0073 1.0062 1.0041 1.0024 1.0048 1.0001 1.0029 1.0067 1.0020 0.9950 1.0037 1.0243 1.0070
dispcorr: -0.033241177 hartree
energy: -2036.220945604816
dipole: -44.62264 42.64218 -1.98046 -25.52281 22.50542 -3.01739 -5.77523 5.94909 0.17386
magnitude: 3.61346 au
magnitude: 9.18468 debye
