program: Orca
programVersion: 5.0.2
elementType: Cl Cl O O O O C C C C C C C C C C C C C C C C C C C C C H H H H H H H H H H H H H H H H H H H H H H H H
charge: 0
multiplicity: 1
keywords: wb97x-d3
keywords: def2-TZVPP
keywords: def2/J RIJCOSX
keywords: DEFGRID2
keywords: scfconv7
keywords: smallprint printgap noloewdin
keywords: NOSOSCF
formula: C21H24Cl2O4
InChI: InChI=1/C21H24Cl2O4/c1-4-20(2,3)19(25)26-17-16(14-9-8-13(22)12-15(14)23)18(24)27-21(17)10-6-5-7-11-21/h8-9,12H,4-7,10-11H2,1-3H3
51 atoms
Cl 1.371193 1.90214 2.483483
Cl 5.867518 0.330662 0.026979
O  -2.039859 2.235259 -0.038917
O  -0.890792 -1.138023 0.182559
O  -0.212145 3.502372 -0.142446
O  -0.69293 -1.490728 -2.01083
C  -2.380872 0.841659 0.034942
C  -3.245315 0.48353 -1.17387
C  -3.117506 0.580837 1.349687
C  -4.602898 1.177384 -1.123329
C  -4.4773 1.270337 1.385396
C  -5.33028 0.885443 0.182867
C  -1.028135 0.19517 0.01887
C  -0.055241 1.099479 -0.039828
C  -0.7136 2.413063 -0.078769
C  -0.410597 -3.373119 -0.513263
C  1.397158 0.91085 -0.028731
C  -0.690639 -1.937012 -0.899534
C  -0.949248 -4.302776 -1.612239
C  1.123037 -3.492046 -0.460293
C  -0.992826 -3.743785 0.850526
C  2.15674 1.259605 1.085841
C  2.061802 0.379519 -1.129671
C  -2.46161 -4.303454 -1.780878
C  3.530282 1.087475 1.116671
C  3.433712 0.193105 -1.125477
C  4.154061 0.551313 0.00187
H  -2.711726 0.73274 -2.093535
H  -3.397405 -0.599405 -1.1732
H  -3.253724 -0.499533 1.45088
H  -2.491699 0.902702 2.186102
H  -5.198742 0.840539 -1.974194
H  -4.477234 2.256891 -1.246197
H  -4.344615 2.355542 1.41391
H  -4.98367 0.999648 2.314164
H  -6.281953 1.420642 0.210863
H  -5.571029 -0.181822 0.233885
H  -0.474031 -4.053617 -2.563662
H  -0.614801 -5.314196 -1.366158
H  1.394256 -4.512907 -0.186827
H  1.558292 -2.822934 0.28393
H  1.579391 -3.272434 -1.426498
H  -2.062786 -3.54679 0.923024
H  -0.498704 -3.216371 1.666376
H  -0.84388 -4.811413 1.019962
H  1.495941 0.115372 -2.01249
H  -2.748509 -4.963138 -2.600793
H  -2.975904 -4.66024 -0.888026
H  -2.85514 -3.312768 -2.016751
H  4.100216 1.362666 1.993382
H  3.928187 -0.221645 -1.992898
elementType: Cl O C H
totalener: -2036.18750433 hartree
nucrepener: 2975.58051615 hartree
electener: -5011.76802048 hartree
oneelecener: -8708.76617950 hartree
twoeener: 3696.99815903 hartree
cpcmener: -0.02946608 hartree
kineticenergy: 2029.96407218 hartree
xcener: -150.488340446975 hartree
chargesum: -0.0000000
charge: -0.063891 -0.078925 -0.312900 -0.285216 -0.417899 -0.405116 0.534301 -0.229409 -0.214978 -0.153160 -0.154018 -0.129393 0.166437 0.010323 0.357559 0.322566 -0.034825 0.240041 -0.168351 -0.350495 -0.345101 0.029106 -0.174892 -0.277508 -0.184410 -0.178264 0.133403 0.103592 0.087499 0.092386 0.097417 0.079935 0.079468 0.079570 0.079736 0.081905 0.068661 0.082303 0.083809 0.112317 0.110903 0.111854 0.107199 0.101876 0.109216 0.158036 0.099274 0.086123 0.080313 0.125933 0.145687
qa: -0.0639 -0.0789 -0.3129 -0.2852 -0.4179 -0.4051 0.5343 -0.2294 -0.2150 -0.1532 -0.1540 -0.1294 0.1664 0.0103 0.3576 0.3226 -0.0348 0.2400 -0.1684 -0.3505 -0.3451 0.0291 -0.1749 -0.2775 -0.1844 -0.1783 0.1334 0.1036 0.0875 0.0924 0.0974 0.0799 0.0795 0.0796 0.0797 0.0819 0.0687 0.0823 0.0838 0.1123 0.1109 0.1119 0.1072 0.1019 0.1092 0.1580 0.0993 0.0861 0.0803 0.1259 0.1457
va: 1.2621 1.2239 2.1233 2.1425 2.1034 2.0889 3.6026 4.0234 3.9894 3.9164 3.9104 3.8708 3.8670 3.3882 4.3614 3.6758 3.4337 4.2119 3.8710 3.9210 3.9504 3.9881 3.9162 3.9423 4.1032 4.0251 3.8619 1.0185 1.0089 1.0149 1.0167 1.0126 1.0156 1.0152 1.0129 1.0096 1.0091 1.0186 1.0082 1.0027 1.0028 1.0069 0.9990 1.0102 0.9995 1.0107 1.0046 0.9985 1.0076 1.0248 1.0072
dispcorr: -0.031789125 hartree
energy: -2036.219293455150
dipole: -49.01259 47.80239 -1.21020 -35.77242 32.25360 -3.51882 -10.83786 11.15641 0.31855
magnitude: 3.73472 au
magnitude: 9.49290 debye
