program: Orca
programVersion: 5.0.2
elementType: Cl Cl O O O O C C C C C C C C C C C C C C C C C C C C C H H H H H H H H H H H H H H H H H H H H H H H H
charge: 0
multiplicity: 1
keywords: wb97x-d3
keywords: def2-TZVPP
keywords: def2/J RIJCOSX
keywords: DEFGRID2
keywords: scfconv7
keywords: smallprint printgap noloewdin
keywords: NOSOSCF
formula: C21H24Cl2O4
InChI: InChI=1/C21H24Cl2O4/c1-4-20(2,3)19(25)26-17-16(14-9-8-13(22)12-15(14)23)18(24)27-21(17)10-6-5-7-11-21/h8-9,12H,4-7,10-11H2,1-3H3
51 atoms
Cl 0.781576 -0.096426 -2.531082
Cl 5.691664 0.236008 -0.431174
O  -2.078519 2.490943 0.305741
O  -1.198329 -0.934814 -0.050491
O  -0.180245 3.651532 0.252622
O  -0.082943 -1.218237 1.863894
C  -2.502435 1.121615 0.23458
C  -3.417215 0.945504 -0.977082
C  -3.214011 0.752183 1.536314
C  -4.728864 1.704561 -0.809169
C  -4.528615 1.510051 1.69369
C  -5.435926 1.317016 0.484391
C  -1.199857 0.402726 0.075417
C  -0.173324 1.250242 0.047377
C  -0.746948 2.592333 0.210353
C  -0.618137 -3.173733 0.528572
C  1.259018 0.998018 -0.095233
C  -0.584188 -1.70787 0.895562
C  0.53852 -3.434801 -0.466854
C  -0.449528 -4.004478 1.798512
C  -1.942526 -3.546469 -0.144231
C  1.801117 0.373032 -1.216357
C  2.133914 1.395452 0.913766
C  1.945877 -3.182159 0.053834
C  3.161071 0.130727 -1.329516
C  3.494874 1.168421 0.825295
C  3.994537 0.53207 -0.300017
H  -2.889905 1.264192 -1.879746
H  -3.625462 -0.122104 -1.090156
H  -3.413883 -0.323167 1.517925
H  -2.549039 0.938902 2.383066
H  -5.368649 1.495443 -1.66899
H  -4.540986 2.781905 -0.821448
H  -4.328794 2.575034 1.841921
H  -5.027273 1.16314 2.60112
H  -6.348074 1.905696 0.604077
H  -5.747617 0.268551 0.427856
H  0.450657 -4.481133 -0.772976
H  0.37029 -2.842658 -1.369596
H  -1.291011 -3.861744 2.478535
H  0.462483 -3.772646 2.346227
H  -0.415367 -5.062668 1.535095
H  -1.967129 -4.625282 -0.303416
H  -2.070172 -3.072584 -1.117211
H  -2.801682 -3.28796 0.477455
H  1.737328 1.881193 1.795654
H  2.200125 -3.838703 0.886376
H  2.67122 -3.373754 -0.737848
H  2.099594 -2.153778 0.383809
H  3.560475 -0.358126 -2.207459
H  4.152256 1.482312 1.624247
elementType: Cl O C H
totalener: -2036.18815268 hartree
nucrepener: 3030.11690905 hartree
electener: -5066.30506173 hartree
oneelecener: -8817.99839485 hartree
twoeener: 3751.69333312 hartree
cpcmener: -0.02926961 hartree
kineticenergy: 2029.97507721 hartree
xcener: -150.493092624474 hartree
chargesum: -0.0000000
charge: -0.073651 -0.079022 -0.316299 -0.296406 -0.426598 -0.390574 0.529592 -0.212804 -0.229726 -0.151901 -0.152243 -0.129090 0.091969 0.096161 0.331671 0.333330 -0.036132 0.269898 -0.188246 -0.347444 -0.343236 0.020039 -0.130601 -0.291302 -0.203959 -0.194788 0.157862 0.095185 0.091605 0.094407 0.101391 0.079286 0.079440 0.078797 0.079502 0.081131 0.069037 0.096455 0.091253 0.112211 0.100564 0.107085 0.105674 0.098830 0.110178 0.150564 0.100775 0.102391 0.069112 0.123420 0.145208
qa: -0.0737 -0.0790 -0.3163 -0.2964 -0.4266 -0.3906 0.5296 -0.2128 -0.2297 -0.1519 -0.1522 -0.1291 0.0920 0.0962 0.3317 0.3333 -0.0361 0.2699 -0.1882 -0.3474 -0.3432 0.0200 -0.1306 -0.2913 -0.2040 -0.1948 0.1579 0.0952 0.0916 0.0944 0.1014 0.0793 0.0794 0.0788 0.0795 0.0811 0.0690 0.0965 0.0913 0.1122 0.1006 0.1071 0.1057 0.0988 0.1102 0.1506 0.1008 0.1024 0.0691 0.1234 0.1452
va: 1.2461 1.2241 2.1247 2.1613 2.0968 2.1072 3.5710 3.9884 3.9998 3.9105 3.9122 3.8703 3.9504 3.2928 4.3751 3.6561 3.4371 4.1820 3.8492 3.9506 3.9318 3.8896 3.9433 3.9509 4.0682 4.0392 3.8202 1.0159 1.0130 1.0125 1.0189 1.0131 1.0150 1.0153 1.0129 1.0099 1.0089 1.0077 1.0220 1.0033 1.0063 1.0000 1.0026 1.0099 1.0052 1.0051 1.0013 1.0026 1.0040 1.0265 1.0070
dispcorr: -0.033862661 hartree
energy: -2036.222015346051
dipole: -41.43330 39.77146 -1.66185 -24.40490 21.44011 -2.96479 12.90168 -13.07333 -0.17165
magnitude: 3.40311 au
magnitude: 8.65002 debye
