program: Orca
programVersion: 5.0.2
elementType: Cl Cl O O O O C C C C C C C C C C C C C C C C C C C C C H H H H H H H H H H H H H H H H H H H H H H H H
charge: 0
multiplicity: 1
keywords: wb97x-d3
keywords: def2-TZVPP
keywords: def2/J RIJCOSX
keywords: DEFGRID2
keywords: scfconv7
keywords: smallprint printgap noloewdin
keywords: NOSOSCF
formula: C21H24Cl2O4
InChI: InChI=1/C21H24Cl2O4/c1-4-20(2,3)19(25)26-17-16(14-9-8-13(22)12-15(14)23)18(24)27-21(17)10-6-5-7-11-21/h8-9,12H,4-7,10-11H2,1-3H3
51 atoms
Cl 1.491259 1.356302 2.377519
Cl 5.508371 -0.140365 -0.826532
O  -2.176391 2.358043 0.28835
O  -1.33084 -0.983533 -0.576716
O  -0.250662 3.48626 0.439462
O  0.048832 -1.616811 1.072226
C  -2.60433 1.025995 0.02273
C  -3.522948 1.025277 -1.200352
C  -3.326191 0.474888 1.255695
C  -4.828744 1.763613 -0.925975
C  -4.631958 1.216948 1.521514
C  -5.540722 1.197198 0.297558
C  -1.309289 0.314106 -0.222309
C  -0.272557 1.132838 -0.073489
C  -0.827724 2.462069 0.252137
C  -0.550418 -3.233418 -0.637173
C  1.14945 0.846317 -0.247941
C  -0.52212 -1.890897 0.066307
C  0.616682 -4.094466 -0.130635
C  -1.876394 -3.911098 -0.251849
C  -0.48792 -3.065052 -2.158338
C  2.049236 0.923376 0.812023
C  1.63418 0.450301 -1.48997
C  2.010759 -3.615286 -0.513837
C  3.390793 0.625857 0.640649
C  2.969779 0.143292 -1.684534
C  3.839007 0.236262 -0.610513
H  -2.99752 1.469064 -2.049519
H  -3.737951 -0.01384 -1.46729
H  -3.53841 -0.585236 1.08538
H  -2.659368 0.530211 2.119207
H  -5.471362 1.693897 -1.80584
H  -4.622694 2.826178 -0.775637
H  -4.414699 2.24985 1.804416
H  -5.134956 0.761275 2.376767
H  -6.452809 1.762994 0.497137
H  -5.855067 0.167817 0.092795
H  0.548737 -4.183932 0.955411
H  0.464679 -5.102931 -0.526874
H  -1.937639 -4.887718 -0.733527
H  -2.74155 -3.329809 -0.571871
H  -1.946753 -4.067139 0.825406
H  0.367292 -2.467495 -2.475017
H  -1.387364 -2.598787 -2.557798
H  -0.392396 -4.046389 -2.625489
H  0.949077 0.397611 -2.326419
H  2.763978 -4.268412 -0.074108
H  2.167364 -3.629654 -1.592588
H  2.214395 -2.605635 -0.157677
H  4.073901 0.690634 1.475353
H  3.330954 -0.154965 -2.658324
totalener: -2036.15966349 hartree
nucrepener: 3018.66964821 hartree
electener: -5054.82931170 hartree
oneelecener: -8795.33930498 hartree
twoeener: 3740.50999328 hartree
kineticenergy: 2030.03662634 hartree
xcener: -150.496226618735 hartree
chargesum: -0.0000000
charge: -0.042991 -0.067846 -0.289670 -0.312859 -0.298562 -0.290752 0.490630 -0.214437 -0.239062 -0.151408 -0.148287 -0.129367 0.136613 0.008337 0.279047 0.309403 -0.038288 0.178510 -0.148220 -0.322715 -0.342902 0.099591 -0.142974 -0.267620 -0.189492 -0.197470 0.139867 0.089226 0.079470 0.077272 0.102488 0.074849 0.087681 0.088341 0.075399 0.081058 0.061920 0.085763 0.072968 0.097759 0.098805 0.111592 0.088786 0.100280 0.102154 0.131973 0.095372 0.076975 0.083958 0.109998 0.118838
qa: -0.0430 -0.0678 -0.2897 -0.3129 -0.2986 -0.2908 0.4906 -0.2144 -0.2391 -0.1514 -0.1483 -0.1294 0.1366 0.0083 0.2790 0.3094 -0.0383 0.1785 -0.1482 -0.3227 -0.3429 0.0996 -0.1430 -0.2676 -0.1895 -0.1975 0.1399 0.0892 0.0795 0.0773 0.1025 0.0748 0.0877 0.0883 0.0754 0.0811 0.0619 0.0858 0.0730 0.0978 0.0988 0.1116 0.0888 0.1003 0.1022 0.1320 0.0954 0.0770 0.0840 0.1100 0.1188
va: 1.2790 1.2349 2.1369 2.1302 2.2226 2.2009 3.6149 3.9837 3.9967 3.9142 3.9037 3.8634 3.8436 3.3856 4.4087 3.6936 3.5188 4.2468 3.8684 3.9165 3.9640 3.9650 3.8842 3.9602 4.1304 4.0463 3.8818 1.0171 1.0161 1.0145 1.0215 1.0127 1.0170 1.0174 1.0132 1.0121 1.0106 1.0165 1.0079 1.0051 1.0097 1.0059 1.0055 1.0137 1.0023 1.0059 1.0104 0.9980 1.0078 1.0312 1.0176
dispcorr: -0.033069123 hartree
energy: -2036.192732615829
dipole: -43.62245 42.24035 -1.38211 -28.85240 26.65365 -2.19875 -12.53489 11.42061 -1.11427
magnitude: 2.82601 au
magnitude: 7.18314 debye
