program: Orca
programVersion: 5.0.2
elementType: Cl Cl O O O O C C C C C C C C C C C C C C C C C C C C C H H H H H H H H H H H H H H H H H H H H H H H H
charge: 0
multiplicity: 1
keywords: wb97x-d3
keywords: def2-TZVPP
keywords: def2/J RIJCOSX
keywords: DEFGRID2
keywords: scfconv7
keywords: smallprint printgap noloewdin
keywords: NOSOSCF
formula: C21H24Cl2O4
InChI: InChI=1/C21H24Cl2O4/c1-4-20(2,3)19(25)26-17-16(14-9-8-13(22)12-15(14)23)18(24)27-21(17)10-6-5-7-11-21/h8-9,12H,4-7,10-11H2,1-3H3
51 atoms
Cl 1.058821 -0.091349 -2.332033
Cl 5.826671 0.749687 -0.067418
O  -2.091968 2.418584 0.355067
O  -1.169669 -0.948567 -0.210077
O  -0.221266 3.603207 0.6272
O  0.508329 -1.437314 1.190066
C  -2.458198 1.067198 0.101655
C  -3.231524 1.000966 -1.217554
C  -3.31104 0.554816 1.263973
C  -4.562639 1.739783 -1.124762
C  -4.645735 1.289172 1.350222
C  -5.407545 1.216728 0.031605
C  -1.129844 0.373489 0.01713
C  -0.124177 1.240407 0.160994
C  -0.752656 2.557818 0.408076
C  -0.561281 -3.248605 -0.019764
C  1.327431 1.099882 0.0892
C  -0.312214 -1.816009 0.416257
C  0.052154 -4.204784 1.015616
C  -2.054015 -3.534207 -0.210185
C  0.161845 -3.450202 -1.361562
C  1.973141 0.503497 -0.990111
C  2.127272 1.615706 1.106926
C  -0.589852 -4.200549 2.395596
C  3.352221 0.387216 -1.049045
C  3.504328 1.512352 1.074392
C  4.108683 0.891434 -0.006729
H  -2.612391 1.408611 -2.020348
H  -3.412587 -0.050522 -1.459261
H  -3.492783 -0.51351 1.112501
H  -2.752313 0.653329 2.198057
H  -5.099984 1.628038 -2.068877
H  -4.381088 2.809931 -0.997987
H  -4.472962 2.333723 1.621257
H  -5.24048 0.855364 2.156942
H  -6.338344 1.783017 0.104253
H  -5.693636 0.177727 -0.167463
H  -0.01723 -5.212389 0.595134
H  1.118664 -3.991543 1.110666
H  -2.644743 -3.297522 0.675074
H  -2.189187 -4.596769 -0.418644
H  -2.473678 -2.981849 -1.049445
H  0.034169 -4.484786 -1.683148
H  1.231026 -3.255499 -1.276187
H  -0.239147 -2.80605 -2.142535
H  1.657536 2.099114 1.951355
H  -0.079065 -4.910392 3.045928
H  -0.527081 -3.225203 2.876525
H  -1.63858 -4.49714 2.363436
H  3.825938 -0.080226 -1.900196
H  4.10237 1.912312 1.880625
totalener: -2036.16107825 hartree
nucrepener: 3006.04164783 hartree
electener: -5042.20272608 hartree
oneelecener: -8770.03557979 hartree
twoeener: 3727.83285371 hartree
kineticenergy: 2030.02576475 hartree
xcener: -150.497127725624 hartree
chargesum: 0.0000000
charge: -0.078775 -0.069823 -0.292832 -0.293896 -0.315086 -0.302392 0.482695 -0.221886 -0.228124 -0.151515 -0.149984 -0.128659 0.116668 0.065310 0.275009 0.294481 -0.027979 0.192098 -0.145134 -0.344387 -0.344853 0.059797 -0.066062 -0.274762 -0.184350 -0.197668 0.138454 0.091278 0.081325 0.074748 0.096316 0.075213 0.087964 0.087938 0.075274 0.081191 0.062572 0.073001 0.087495 0.095494 0.105152 0.100345 0.101401 0.112122 0.100709 0.111428 0.092967 0.093257 0.076022 0.109392 0.121052
qa: -0.0788 -0.0698 -0.2928 -0.2939 -0.3151 -0.3024 0.4827 -0.2219 -0.2281 -0.1515 -0.1500 -0.1287 0.1167 0.0653 0.2750 0.2945 -0.0280 0.1921 -0.1451 -0.3444 -0.3449 0.0598 -0.0661 -0.2748 -0.1843 -0.1977 0.1385 0.0913 0.0813 0.0747 0.0963 0.0752 0.0880 0.0879 0.0753 0.0812 0.0626 0.0730 0.0875 0.0955 0.1052 0.1003 0.1014 0.1121 0.1007 0.1114 0.0930 0.0933 0.0760 0.1094 0.1211
va: 1.2515 1.2352 2.1455 2.1500 2.2063 2.1813 3.6433 3.9845 3.9921 3.9099 3.9140 3.8644 3.8073 3.3371 4.3974 3.6930 3.4821 4.2598 3.8636 3.9563 3.9235 3.9319 3.9857 3.9443 4.1231 4.0749 3.9053 1.0201 1.0152 1.0156 1.0189 1.0131 1.0170 1.0174 1.0127 1.0120 1.0104 1.0088 1.0163 1.0007 1.0043 1.0110 1.0080 1.0065 1.0113 1.0190 1.0068 1.0098 0.9990 1.0290 1.0147
dispcorr: -0.031897619 hartree
energy: -2036.192975866553
dipole: -48.27440 46.87594 -1.39846 -27.91402 25.90158 -2.01244 9.62827 -9.82843 -0.20016
magnitude: 2.45879 au
magnitude: 6.24975 debye
