program: Orca
programVersion: 5.0.2
elementType: Cl Cl O O O O C C C C C C C C C C C C C C C C C C C C C H H H H H H H H H H H H H H H H H H H H H H H H
charge: 0
multiplicity: 1
keywords: wb97x-d3
keywords: def2-TZVPP
keywords: def2/J RIJCOSX
keywords: DEFGRID2
keywords: scfconv7
keywords: smallprint printgap noloewdin
keywords: NOSOSCF
formula: C21H24Cl2O4
InChI: InChI=1/C21H24Cl2O4/c1-4-20(2,3)19(25)26-17-16(14-9-8-13(22)12-15(14)23)18(24)27-21(17)10-6-5-7-11-21/h8-9,12H,4-7,10-11H2,1-3H3
51 atoms
Cl 1.39709 1.57048 2.461689
Cl 5.720732 0.156462 -0.369309
O  -2.104621 2.303829 0.076883
O  -1.106567 -1.117498 0.238658
O  -0.220341 3.488474 -0.14858
O  -0.768087 -1.451393 -1.94564
C  -2.487677 0.934682 0.180605
C  -3.425224 0.58856 -0.977894
C  -3.170655 0.708452 1.531349
C  -4.745962 1.343955 -0.874623
C  -4.494928 1.459481 1.62455
C  -5.421864 1.098503 0.469284
C  -1.170635 0.225176 0.089771
C  -0.168134 1.082326 -0.045992
C  -0.7666 2.435215 -0.050347
C  -0.770003 -3.371735 -0.47135
C  1.273297 0.838568 -0.130393
C  -0.85046 -1.903017 -0.844046
C  0.175978 -4.080803 -1.454046
C  -0.320384 -3.585947 0.975085
C  -2.189927 -3.9363 -0.651471
C  2.093954 1.051217 0.973814
C  1.866517 0.414503 -1.314343
C  1.638086 -3.665051 -1.366474
C  3.46173 0.843568 0.913188
C  3.231266 0.198497 -1.399982
C  4.018064 0.416884 -0.281157
H  -2.924998 0.794509 -1.926211
H  -3.62224 -0.488007 -0.953284
H  -3.346824 -0.364686 1.652966
H  -2.492564 1.009843 2.333582
H  -5.399635 1.03336 -1.69219
H  -4.568274 2.413656 -1.010807
H  -4.305739 2.535721 1.624499
H  -4.969889 1.229806 2.580447
H  -6.347418 1.673654 0.536091
H  -5.708329 0.043665 0.54621
H  0.095444 -5.154691 -1.261365
H  -0.186379 -3.927589 -2.472223
H  -1.057242 -3.227258 1.692419
H  0.624975 -3.092774 1.199069
H  -0.185021 -4.654201 1.152075
H  -2.534119 -3.833537 -1.680923
H  -2.909303 -3.441851 0.003033
H  -2.193908 -4.997795 -0.400647
H  1.243674 0.253799 -2.183251
H  2.223834 -4.189246 -2.121269
H  1.775216 -2.597156 -1.538921
H  2.077619 -3.903659 -0.398155
H  4.081584 1.014087 1.78151
H  3.677974 -0.128277 -2.328203
totalener: -2036.16060883 hartree
nucrepener: 2990.78606292 hartree
electener: -5026.94667175 hartree
oneelecener: -8739.29687123 hartree
twoeener: 3712.35019947 hartree
kineticenergy: 2030.02931114 hartree
xcener: -150.494241058139 hartree
chargesum: 0.0000000
charge: -0.053456 -0.065406 -0.288867 -0.293323 -0.299829 -0.324450 0.492891 -0.235231 -0.218816 -0.146574 -0.151608 -0.131006 0.177367 -0.004527 0.301021 0.299925 -0.020557 0.160294 -0.155829 -0.328153 -0.324576 0.051615 -0.165669 -0.261876 -0.202651 -0.189420 0.142586 0.103417 0.074534 0.078648 0.092751 0.075913 0.087403 0.088412 0.075344 0.081850 0.062044 0.074557 0.087675 0.097173 0.102233 0.099911 0.114755 0.096464 0.098804 0.150136 0.093110 0.079743 0.080742 0.113616 0.126890
qa: -0.0535 -0.0654 -0.2889 -0.2933 -0.2998 -0.3245 0.4929 -0.2352 -0.2188 -0.1466 -0.1516 -0.1310 0.1774 -0.0045 0.3010 0.2999 -0.0206 0.1603 -0.1558 -0.3282 -0.3246 0.0516 -0.1657 -0.2619 -0.2027 -0.1894 0.1426 0.1034 0.0745 0.0786 0.0928 0.0759 0.0874 0.0884 0.0753 0.0818 0.0620 0.0746 0.0877 0.0972 0.1022 0.0999 0.1148 0.0965 0.0988 0.1501 0.0931 0.0797 0.0807 0.1136 0.1269
va: 1.2716 1.2397 2.1407 2.1209 2.2238 2.1655 3.6674 4.0080 3.9828 3.8990 3.9087 3.8602 3.7964 3.3940 4.3962 3.7114 3.4667 4.2646 3.8775 3.9657 3.9188 4.0001 3.9090 3.9562 4.1252 4.0237 3.9022 1.0225 1.0134 1.0178 1.0218 1.0127 1.0178 1.0172 1.0126 1.0119 1.0108 1.0074 1.0197 1.0137 1.0031 1.0004 1.0078 1.0078 1.0056 1.0136 1.0076 1.0066 1.0016 1.0288 1.0137
dispcorr: -0.032189558 hartree
energy: -2036.192798391234
dipole: -44.33570 43.24682 -1.08888 -32.17584 29.85216 -2.32368 -7.57025 7.78203 0.21178
magnitude: 2.57488 au
magnitude: 6.54482 debye
