program: Orca
programVersion: 5.0.2
elementType: Cl Cl O O O O C C C C C C C C C C C C C C C C C C C C C H H H H H H H H H H H H H H H H H H H H H H H H
charge: 0
multiplicity: 1
keywords: wb97x-d3
keywords: def2-TZVPP
keywords: def2/J RIJCOSX
keywords: DEFGRID2
keywords: scfconv7
keywords: smallprint printgap noloewdin
keywords: NOSOSCF
formula: C21H24Cl2O4
InChI: InChI=1/C21H24Cl2O4/c1-4-20(2,3)19(25)26-17-16(14-9-8-13(22)12-15(14)23)18(24)27-21(17)10-6-5-7-11-21/h8-9,12H,4-7,10-11H2,1-3H3
51 atoms
Cl 0.771651 -0.08505 -2.552331
Cl 5.698093 0.223728 -0.499611
O  -2.068517 2.472616 0.336907
O  -1.164347 -0.950389 -0.075615
O  -0.153646 3.626334 0.35219
O  -0.323871 -1.240458 1.980415
C  -2.484457 1.111991 0.234765
C  -3.391083 0.955317 -0.988007
C  -3.217828 0.717398 1.51819
C  -4.697291 1.7252 -0.823372
C  -4.522703 1.49178 1.677266
C  -5.421611 1.325024 0.457279
C  -1.18275 0.38952 0.069134
C  -0.159794 1.236161 0.050573
C  -0.726725 2.585009 0.257148
C  -0.637624 -3.183576 0.557038
C  1.268855 0.979001 -0.106079
C  -0.671816 -1.720128 0.947253
C  0.517259 -3.390336 -0.449421
C  -0.427512 -4.025146 1.813698
C  -1.956913 -3.591172 -0.110325
C  1.800165 0.374343 -1.24301
C  2.15502 1.363507 0.897276
C  1.91353 -3.076642 0.071368
C  3.159664 0.137981 -1.373182
C  3.513554 1.135241 0.792551
C  4.006175 0.518846 -0.347305
H  -2.8541 1.283116 -1.881449
H  -3.605539 -0.109469 -1.120716
H  -3.435957 -0.354201 1.473374
H  -2.561113 0.869861 2.377024
H  -5.33236 1.541581 -1.692338
H  -4.490881 2.798225 -0.812359
H  -4.303029 2.550663 1.834084
H  -5.035463 1.146165 2.57711
H  -6.329795 1.918948 0.576248
H  -5.74422 0.28078 0.382478
H  0.476368 -4.437093 -0.766006
H  0.320134 -2.79851 -1.346194
H  -1.273636 -3.938846 2.496124
H  0.465767 -3.741834 2.365856
H  -0.333206 -5.075803 1.535175
H  -1.942089 -4.663661 -0.307187
H  -2.118074 -3.084285 -1.06045
H  -2.815391 -3.391699 0.533607
H  1.763917 1.8428 1.78393
H  2.205831 -3.738454 0.88604
H  2.645459 -3.204201 -0.725902
H  2.009421 -2.050613 0.429471
H  3.549561 -0.331621 -2.26487
H  4.183345 1.435383 1.585433
totalener: -2036.16188136 hartree
nucrepener: 3030.51155146 hartree
electener: -5066.67343283 hartree
oneelecener: -8818.75784006 hartree
twoeener: 3752.08440723 hartree
kineticenergy: 2030.02652729 hartree
xcener: -150.495921570259 hartree
chargesum: -0.0000000
charge: -0.066344 -0.064170 -0.289116 -0.298345 -0.309803 -0.298049 0.493129 -0.217250 -0.233293 -0.149743 -0.150352 -0.130690 0.083433 0.082746 0.267628 0.305256 -0.012479 0.180525 -0.205208 -0.314910 -0.325021 0.008882 -0.063221 -0.269171 -0.210756 -0.184718 0.152021 0.091037 0.080404 0.075644 0.105154 0.075332 0.087980 0.087347 0.076045 0.081285 0.062767 0.086800 0.094014 0.099138 0.106251 0.096628 0.097467 0.101296 0.095452 0.117673 0.092738 0.096234 0.077967 0.111392 0.122973
qa: -0.0663 -0.0642 -0.2891 -0.2983 -0.3098 -0.2980 0.4931 -0.2172 -0.2333 -0.1497 -0.1504 -0.1307 0.0834 0.0827 0.2676 0.3053 -0.0125 0.1805 -0.2052 -0.3149 -0.3250 0.0089 -0.0632 -0.2692 -0.2108 -0.1847 0.1520 0.0910 0.0804 0.0756 0.1052 0.0753 0.0880 0.0873 0.0760 0.0813 0.0628 0.0868 0.0940 0.0991 0.1063 0.0966 0.0975 0.1013 0.0955 0.1177 0.0927 0.0962 0.0780 0.1114 0.1230
va: 1.2544 1.2404 2.1449 2.1208 2.2137 2.1927 3.6300 3.9786 3.9984 3.9067 3.9066 3.8626 3.9053 3.3520 4.4221 3.6970 3.4815 4.2550 3.8523 3.9585 3.9346 3.8983 3.9721 3.9513 4.0756 4.0538 3.8813 1.0204 1.0155 1.0152 1.0234 1.0128 1.0168 1.0178 1.0125 1.0120 1.0106 1.0099 1.0254 1.0093 1.0080 1.0010 1.0061 1.0117 1.0083 1.0154 1.0065 1.0044 1.0062 1.0309 1.0147
dispcorr: -0.033987818 hartree
energy: -2036.195869179354
dipole: -41.20999 40.15708 -1.05291 -24.14229 22.18696 -1.95533 12.97236 -13.09487 -0.12252
magnitude: 2.22417 au
magnitude: 5.65338 debye
