program: Orca
programVersion: 5.0.2
elementType: F F F F F F O O O N N N C C C C C C C C C C C C C C C C C C C C C C C C C H H H H H H H H H H H H H H H H H H H H H H H H H H H H H H H
charge: 0
multiplicity: 1
keywords: wb97x-d3
keywords: def2-TZVPP
keywords: def2/J RIJCOSX
keywords: DEFGRID2
keywords: scfconv7
keywords: smallprint printgap noloewdin
keywords: NOSOSCF
formula: C25H31F6N3O3
InChI: InChI=1/C25H31F6N3O3/c1-13(2)11-17-12-18(9-10-19(17)23(37-8,24(26,27)28)25(29,30)31)34(21(35)14(3)4)22(36)20-15(5)32-33(7)16(20)6/h9-10,12-14H,11H2,1-8H3
68 atoms
F  -3.51604 -2.068636 1.676443
F  -4.309592 -0.199316 2.341465
F  -2.234665 -0.633112 2.643532
F  -3.690251 -1.858259 -0.970389
F  -3.777698 0.120681 -1.787636
F  -5.173011 -0.462419 -0.271863
O  -3.219337 1.27343 0.54033
O  2.433888 -2.718746 -2.006576
O  4.557089 0.198102 -0.64821
N  2.662657 -1.052545 -0.504156
N  2.403867 2.702319 1.991776
N  2.014047 1.699737 2.789809
C  -2.909034 -0.075373 0.410718
C  -1.467906 -0.361205 -0.040212
C  -0.686157 0.563933 -0.758913
C  -1.138242 1.870205 -1.381825
C  -0.661084 2.087799 -2.827267
C  0.669129 0.272423 -0.920326
C  1.249397 -0.883495 -0.440231
C  -0.89124 -1.586297 0.315058
C  -3.244083 -0.765257 1.781942
C  -3.90444 -0.58034 -0.665125
C  0.446618 -1.858551 0.125455
C  -1.132179 0.985775 -3.767149
C  -1.145824 3.449022 -3.311207
C  3.157941 -2.15707 -1.214835
C  4.530603 -2.696534 -0.877198
C  3.484142 0.008718 -0.10794
C  2.959835 0.890446 0.930179
C  -2.489597 2.073646 1.468115
C  2.993958 2.277545 0.868546
C  2.326422 0.587712 2.159569
C  5.438215 -2.667236 -2.102955
C  4.353582 -4.126107 -0.359524
C  3.463027 3.213412 -0.181182
C  2.057389 -0.737657 2.78131
C  2.175245 4.07681 2.370314
H  -2.2174 1.974123 -1.376504
H  -0.751531 2.69187 -0.769753
H  0.432188 2.109889 -2.849493
H  1.298565 0.996762 -1.420646
H  -1.467035 -2.367339 0.786383
H  0.858549 -2.797927 0.468881
H  -0.744262 1.147169 -4.774244
H  -0.800067 -0.002953 -3.446444
H  -2.221331 0.966217 -3.836895
H  -0.785963 4.254914 -2.668903
H  -2.237175 3.497028 -3.323982
H  -0.794736 3.652752 -4.323957
H  4.987466 -2.113971 -0.079768
H  -2.921582 2.022349 2.46888
H  -2.572845 3.099009 1.116021
H  -1.432029 1.81251 1.523021
H  5.029992 -3.271522 -2.913557
H  6.415532 -3.075119 -1.84556
H  5.58797 -1.654718 -2.475809
H  3.950603 -4.787849 -1.125907
H  3.693571 -4.163871 0.508611
H  5.323057 -4.519535 -0.053988
H  3.81765 2.678345 -1.057253
H  4.281109 3.838417 0.180794
H  2.658442 3.878911 -0.497836
H  2.673004 -1.520655 2.343429
H  2.267581 -0.708866 3.850027
H  1.013258 -1.029656 2.662531
H  3.116629 4.612579 2.480145
H  1.564815 4.585669 1.625979
H  1.650969 4.089851 3.320108
elementType: F O N C H
totalener: -1960.59500333 hartree
nucrepener: 4769.70411949 hartree
electener: -6730.29912282 hartree
twoeener: 5454.35397569 hartree
cpcmener: -0.04713653 hartree
kineticenergy: 1952.80567350 hartree
xcener: -178.397976035866 hartree
chargesum: -0.0000000
charge: -0.166346 -0.161428 -0.164517 -0.164465 -0.161348 -0.165115 -0.359170 -0.460511 -0.465331 0.033445 0.141358 -0.353445 0.227336 -0.002441 0.002115 -0.246142 0.115250 -0.238061 0.007288 -0.117701 0.508634 0.477231 -0.223844 -0.316565 -0.309582 0.302455 0.060901 0.323119 -0.034059 -0.129610 -0.010714 0.062015 -0.286028 -0.287668 -0.260988 -0.291217 -0.174477 0.104157 0.103826 0.038605 0.150802 0.149009 0.156225 0.099378 0.095371 0.080921 0.091443 0.086182 0.094260 0.055191 0.119490 0.130169 0.110569 0.092751 0.100618 0.095056 0.091297 0.104796 0.101909 0.101560 0.128753 0.115148 0.107984 0.115458 0.105876 0.129067 0.123121 0.110633
qa: -0.1663 -0.1614 -0.1645 -0.1645 -0.1613 -0.1651 -0.3592 -0.4605 -0.4653 0.0334 0.1414 -0.3534 0.2273 -0.0024 0.0021 -0.2461 0.1152 -0.2381 0.0073 -0.1177 0.5086 0.4772 -0.2238 -0.3166 -0.3096 0.3025 0.0609 0.3231 -0.0341 -0.1296 -0.0107 0.0620 -0.2860 -0.2877 -0.2610 -0.2912 -0.1745 0.1042 0.1038 0.0386 0.1508 0.1490 0.1562 0.0994 0.0954 0.0809 0.0914 0.0862 0.0943 0.0552 0.1195 0.1302 0.1106 0.0928 0.1006 0.0951 0.0913 0.1048 0.1019 0.1016 0.1288 0.1151 0.1080 0.1155 0.1059 0.1291 0.1231 0.1106
va: 1.1440 1.1568 1.1391 1.1481 1.1491 1.1523 1.9569 2.0358 2.0152 3.0003 3.3438 2.9193 4.0357 3.5582 3.5580 3.8049 3.7822 4.0404 3.7322 3.9130 4.4260 4.4793 4.0091 3.9271 3.9304 4.0430 3.8346 4.1090 3.4333 3.8722 3.9370 3.9204 3.9228 3.9288 3.9485 3.9939 3.8808 1.0309 1.0002 1.0200 0.9873 1.0225 1.0056 1.0054 1.0021 1.0089 1.0036 1.0023 1.0041 1.0392 1.0009 0.9883 0.9859 1.0111 1.0012 1.0167 1.0145 1.0032 1.0014 1.0143 0.9935 0.9927 1.0004 1.0108 0.9939 0.9864 0.9869 1.0125
dispcorr: -0.045832457 hartree
energy: -1960.640835786375
dipole: 59.95834 -58.71400 1.24434 23.54505 -20.85063 2.69442 -18.37968 19.65705 1.27737
magnitude: 3.23109 au
magnitude: 8.21279 debye
