program: Orca
programVersion: 5.0.2
elementType: F F F F F F O O O N N N C C C C C C C C C C C C C C C C C C C C C C C C C H H H H H H H H H H H H H H H H H H H H H H H H H H H H H H H
charge: 0
multiplicity: 1
keywords: wb97x-d3
keywords: def2-TZVPP
keywords: def2/J RIJCOSX
keywords: DEFGRID2
keywords: scfconv7
keywords: smallprint printgap noloewdin
keywords: NOSOSCF
formula: C25H31F6N3O3
InChI: InChI=1/C25H31F6N3O3/c1-13(2)11-17-12-18(9-10-19(17)23(37-8,24(26,27)28)25(29,30)31)34(21(35)14(3)4)22(36)20-15(5)32-33(7)16(20)6/h9-10,12-14H,11H2,1-8H3
68 atoms
F  -2.65769 -0.243094 2.719856
F  -3.46955 -2.132497 2.079647
F  -4.70646 -0.392813 2.115932
F  -3.537311 -0.961028 -1.886664
F  -5.041083 -1.522484 -0.455218
F  -3.193851 -2.602475 -0.550953
O  -3.454817 0.912167 0.263881
O  2.165465 -3.07895 -1.476136
O  4.267988 0.055376 -1.612222
N  2.582709 -1.047613 -0.566828
N  3.270317 3.221882 0.927929
N  2.968759 2.456533 1.987944
C  -3.066401 -0.413764 0.382454
C  -1.548157 -0.487698 0.149495
C  -0.873942 0.369542 -0.742026
C  -1.438422 1.53354 -1.527366
C  -1.37352 2.896468 -0.814091
C  0.488974 0.139148 -0.957499
C  1.196812 -0.853114 -0.307662
C  -0.82332 -1.507062 0.775433
C  -3.474199 -0.817685 1.839764
C  -3.726223 -1.384804 -0.638044
C  0.528842 -1.685611 0.575525
C  0.050189 3.306714 -0.461888
C  -2.030682 3.95172 -1.696188
C  2.987057 -2.312779 -1.025205
C  4.419084 -2.741218 -0.7899
C  3.427407 0.060771 -0.730544
C  3.241148 1.187155 0.164976
C  -4.709037 1.349962 -0.253793
C  3.452516 2.516685 -0.190849
C  2.935987 1.21782 1.549043
C  5.061429 -3.215748 -2.087773
C  4.387861 -3.856376 0.259308
C  3.764146 3.155354 -1.492638
C  2.671486 0.09201 2.483798
C  3.297687 4.660795 1.051604
H  -0.844042 1.619591 -2.442183
H  -2.455704 1.353193 -1.863284
H  -1.939889 2.831445 0.117252
H  0.997173 0.763937 -1.682084
H  -1.29348 -2.205595 1.449473
H  1.048065 -2.471344 1.107665
H  0.684691 3.353512 -1.351094
H  0.059394 4.295836 0.000349
H  0.511178 2.615642 0.244358
H  -1.494279 4.064592 -2.641674
H  -2.039429 4.926477 -1.205738
H  -3.064543 3.691642 -1.932124
H  5.007707 -1.924043 -0.376909
H  -5.571606 0.924145 0.256589
H  -4.80075 1.177592 -1.327063
H  -4.719847 2.424703 -0.087383
H  4.523091 -4.063924 -2.512481
H  6.086233 -3.535763 -1.897214
H  5.093373 -2.423169 -2.835834
H  3.9162 -3.525035 1.186162
H  5.408438 -4.156337 0.498006
H  3.854948 -4.73639 -0.101483
H  4.818699 3.431059 -1.554744
H  3.178117 4.063627 -1.635781
H  3.546475 2.485347 -2.320311
H  3.269483 -0.784853 2.239539
H  2.906185 0.38614 3.505618
H  1.623325 -0.208476 2.462669
H  4.252189 5.05968 0.71351
H  2.49755 5.116156 0.469292
H  3.160538 4.91743 2.096944
elementType: F O N C H
totalener: -1960.59467092 hartree
nucrepener: 4729.25667479 hartree
electener: -6689.85134571 hartree
twoeener: 5414.75494432 hartree
cpcmener: -0.04517231 hartree
kineticenergy: 1952.77230817 hartree
xcener: -178.390521838521 hartree
chargesum: 0.0000000
charge: -0.164138 -0.169151 -0.164949 -0.161859 -0.163544 -0.161351 -0.344829 -0.457324 -0.467722 0.055801 0.159679 -0.343945 0.109650 -0.021832 0.043674 -0.163416 0.083027 -0.251283 0.028379 -0.024262 0.490152 0.492605 -0.309074 -0.328474 -0.306568 0.288318 0.060097 0.318917 -0.028239 -0.131481 -0.057429 0.063440 -0.280328 -0.289157 -0.259954 -0.293803 -0.170749 0.111636 0.102929 0.051659 0.146032 0.149566 0.156366 0.085478 0.100551 0.090780 0.087173 0.092622 0.091971 0.057202 0.126696 0.114960 0.121218 0.089875 0.100191 0.094753 0.103322 0.103197 0.094347 0.134519 0.108116 0.107538 0.111573 0.109364 0.113954 0.133796 0.118175 0.111561
qa: -0.1641 -0.1692 -0.1649 -0.1619 -0.1635 -0.1614 -0.3448 -0.4573 -0.4677 0.0558 0.1597 -0.3439 0.1097 -0.0218 0.0437 -0.1634 0.0830 -0.2513 0.0284 -0.0243 0.4902 0.4926 -0.3091 -0.3285 -0.3066 0.2883 0.0601 0.3189 -0.0282 -0.1315 -0.0574 0.0634 -0.2803 -0.2892 -0.2600 -0.2938 -0.1707 0.1116 0.1029 0.0517 0.1460 0.1496 0.1564 0.0855 0.1006 0.0908 0.0872 0.0926 0.0920 0.0572 0.1267 0.1150 0.1212 0.0899 0.1002 0.0948 0.1033 0.1032 0.0943 0.1345 0.1081 0.1075 0.1116 0.1094 0.1140 0.1338 0.1182 0.1116
va: 1.1488 1.1410 1.1428 1.1473 1.1460 1.1560 1.9517 2.0394 2.0185 2.9581 3.3270 2.9304 4.0934 3.6331 3.6805 3.7834 3.7826 4.0579 3.7205 3.8686 4.4884 4.4141 4.0605 3.9732 3.9283 4.0563 3.8293 4.1008 3.3770 3.8607 3.9550 3.9339 3.9233 3.9296 3.9425 3.9845 3.8825 1.0065 1.0128 1.0357 0.9947 1.0232 1.0062 0.9981 1.0040 0.9904 1.0021 1.0055 1.0017 1.0364 1.0003 0.9913 0.9854 1.0130 1.0014 1.0149 1.0029 1.0014 1.0136 0.9931 0.9962 1.0069 0.9957 1.0158 0.9890 0.9848 0.9837 1.0122
dispcorr: -0.047022225 hartree
energy: -1960.641693141403
dipole: 56.60166 -56.35405 0.24761 35.02290 -32.04897 2.97393 -14.41551 14.61898 0.20347
magnitude: 2.99115 au
magnitude: 7.60289 debye
