program: Orca
programVersion: 5.0.2
elementType: F F F F F F O O O N N N C C C C C C C C C C C C C C C C C C C C C C C C C H H H H H H H H H H H H H H H H H H H H H H H H H H H H H H H
charge: 0
multiplicity: 1
keywords: wb97x-d3
keywords: def2-TZVPP
keywords: def2/J RIJCOSX
keywords: DEFGRID2
keywords: scfconv7
keywords: smallprint printgap noloewdin
keywords: NOSOSCF
formula: C25H31F6N3O3
InChI: InChI=1/C25H31F6N3O3/c1-13(2)11-17-12-18(9-10-19(17)23(37-8,24(26,27)28)25(29,30)31)34(21(35)14(3)4)22(36)20-15(5)32-33(7)16(20)6/h9-10,12-14H,11H2,1-8H3
68 atoms
F  -5.101841 -0.767164 0.085987
F  -3.747412 -0.664037 1.744334
F  -3.530609 -2.224102 0.289271
F  -4.257411 0.459085 -2.235856
F  -3.33239 -1.466856 -2.270471
F  -2.154101 0.301853 -2.621888
O  -3.254715 1.261423 -0.008714
O  2.492539 -3.165942 1.129079
O  4.533048 0.243679 0.903545
N  2.733367 -1.065639 0.373237
N  1.824317 2.416963 -1.921928
N  2.098177 3.248919 -0.906438
C  -2.864125 -0.024721 -0.358044
C  -1.412814 -0.382048 0.003041
C  -0.691865 0.249655 1.035739
C  -1.208784 1.258256 2.044121
C  -0.805941 0.983866 3.501878
C  0.668473 -0.047716 1.14412
C  1.311921 -0.939067 0.309876
C  -0.771354 -1.376496 -0.74498
C  -3.827835 -0.935193 0.445276
C  -3.152488 -0.197796 -1.892741
C  0.569644 -1.663086 -0.60564
C  -1.313702 2.123689 4.3767
C  -1.3285 -0.35432 4.007776
C  3.253781 -2.326926 0.699362
C  4.703844 -2.63477 0.389185
C  3.48992 0.115323 0.295468
C  2.901504 1.203236 -0.479478
C  -2.559476 2.377148 -0.562581
C  2.280149 1.174275 -1.720731
C  2.767579 2.535978 -0.027212
C  4.951705 -2.485102 -1.115962
C  5.071151 -4.034928 0.860962
C  2.154414 0.113659 -2.748038
C  3.229581 3.116488 1.260815
C  1.09577 2.882444 -3.079287
H  -0.815922 2.241292 1.764215
H  -2.288933 1.347896 2.017832
H  0.284719 0.97603 3.583347
H  1.253346 0.469351 1.894386
H  -1.296397 -1.949785 -1.492683
H  1.02987 -2.402268 -1.246981
H  -1.024178 1.978872 5.41882
H  -0.912568 3.086073 4.053532
H  -2.403818 2.190318 4.342908
H  -0.999611 -1.188841 3.38617
H  -2.419598 -0.366013 4.035605
H  -0.976562 -0.546862 5.022594
H  5.339215 -1.924874 0.916327
H  -1.490464 2.200151 -0.686582
H  -2.691645 3.198512 0.137933
H  -2.984504 2.67761 -1.521762
H  4.811842 -1.466268 -1.476325
H  4.293425 -3.139982 -1.689137
H  5.9797 -2.7681 -1.341711
H  4.515773 -4.80812 0.329195
H  4.902978 -4.166984 1.929562
H  6.131635 -4.204711 0.674839
H  2.650185 -0.80005 -2.430759
H  2.617479 0.430614 -3.684599
H  1.110019 -0.118574 -2.961295
H  2.83695 4.12371 1.389768
H  2.897836 2.515026 2.108614
H  4.317354 3.171909 1.308945
H  0.692184 3.865536 -2.859218
H  1.743372 2.953692 -3.952368
H  0.271436 2.208243 -3.303774
elementType: F O N C H
totalener: -1960.59476204 hartree
nucrepener: 4807.97574897 hartree
electener: -6768.57051102 hartree
twoeener: 5491.85159888 hartree
cpcmener: -0.04722315 hartree
kineticenergy: 1952.78753754 hartree
xcener: -178.396701402934 hartree
chargesum: 0.0000000
charge: -0.165532 -0.160361 -0.164837 -0.161793 -0.166795 -0.163534 -0.359873 -0.460336 -0.452655 0.033339 0.163737 -0.355954 0.226113 -0.018488 0.018467 -0.242393 0.109739 -0.267598 0.061129 -0.114451 0.476419 0.509890 -0.246281 -0.305998 -0.321194 0.311876 0.073725 0.250568 0.008736 -0.124013 -0.028193 0.039631 -0.305497 -0.302539 -0.284064 -0.268701 -0.177828 0.102141 0.105988 0.040315 0.148112 0.150934 0.155814 0.093509 0.091283 0.085322 0.096160 0.080103 0.100642 0.081522 0.107459 0.130118 0.120745 0.103503 0.103278 0.109113 0.088173 0.100799 0.098221 0.103078 0.138214 0.123029 0.100873 0.103481 0.107995 0.114841 0.135948 0.114826
qa: -0.1655 -0.1604 -0.1648 -0.1618 -0.1668 -0.1635 -0.3599 -0.4603 -0.4527 0.0333 0.1637 -0.3560 0.2261 -0.0185 0.0185 -0.2424 0.1097 -0.2676 0.0611 -0.1145 0.4764 0.5099 -0.2463 -0.3060 -0.3212 0.3119 0.0737 0.2506 0.0087 -0.1240 -0.0282 0.0396 -0.3055 -0.3025 -0.2841 -0.2687 -0.1778 0.1021 0.1060 0.0403 0.1481 0.1509 0.1558 0.0935 0.0913 0.0853 0.0962 0.0801 0.1006 0.0815 0.1075 0.1301 0.1207 0.1035 0.1033 0.1091 0.0882 0.1008 0.0982 0.1031 0.1382 0.1230 0.1009 0.1035 0.1080 0.1148 0.1359 0.1148
va: 1.1522 1.1505 1.1473 1.1565 1.1431 1.1380 1.9587 2.0319 2.0246 2.9790 3.3086 2.9176 4.0414 3.5889 3.5320 3.7918 3.7893 4.0682 3.6900 3.9178 4.4807 4.4166 4.0154 3.9292 3.9257 4.0632 3.7401 4.1559 3.3996 3.8767 3.9459 3.9641 3.9227 3.9568 3.9650 3.9512 3.8773 1.0016 1.0295 1.0192 0.9957 1.0216 1.0072 1.0042 1.0038 1.0023 1.0020 1.0089 1.0052 1.0416 0.9810 0.9886 1.0003 1.0007 1.0008 1.0036 1.0063 1.0066 1.0035 1.0036 0.9938 0.9906 1.0145 0.9946 1.0001 1.0107 0.9877 0.9906
dispcorr: -0.047351839 hartree
energy: -1960.642113881049
dipole: 55.95125 -55.32402 0.62722 14.38013 -13.06513 1.31500 19.21565 -21.68051 -2.46486
magnitude: 2.86324 au
magnitude: 7.27778 debye
