program: Gaussian 09
title: 000006645
version: EM64L-G09RevD.01
frameworkgroup: C1[X(C8H10O3S)]
method: RPBEPBE
basis: SDD
operation: Freq
keyword: #p
keyword: freq=noraman
keyword: PBEPBE/SDD
title: #p freq=noraman PBEPBE/SDD
converged: YES YES NO NO
title: Mulliken charges:
elementType: S O O O C C C C C C C C H H H H H H H H H H
charge: 0.983711 -0.395545 -0.513254 -0.513301 -0.043836 0.454031 -0.234153 -0.234624 -0.360039 -0.358982 -0.797946 -0.483492 0.283277 0.283338 0.246131 0.246112 0.231913 0.231815 0.244947 0.242297 0.242287 0.245312
chargesum: 0.00000
title: Mulliken charges with hydrogens summed into heavy atoms:
elementType: S O O O C C C C C C C C
charge: 0.983711 -0.395545 -0.513254 -0.513301 -0.043836 0.454031 0.049124 0.048714 -0.113908 -0.112870 -0.089272 0.246404
polarizability: 1.72730882e+02 -1.69333125e-02 1.15293588e+02 -1.64603556e+00 5.31747166e-02 8.16272052e+01
1716.lowfreq: -46.5009 -12.2143 -0.0031 -0.0028 -0.0002 7.5303 13.0443 24.2325 51.2372
frequency: -45.8343 23.9576 51.1292 63.7535 116.3058 129.2918 135.3006 211.4417 235.1951 247.3137 311.2268 315.4996 355.5500 385.0530 408.1383 463.2949 477.5732 531.0565 597.0583 620.7875 706.9395 777.3251 826.5412 832.8265 848.7840 924.4716 954.8084 964.8195 984.8180 990.7923 994.3104 1048.8748 1055.0704 1108.9913 1110.6460 1119.4284 1185.2070 1218.1538 1297.6919 1382.4973 1393.0434 1398.4499 1407.8233 1439.6332 1469.9229 1472.5285 1473.5328 1474.3940 1594.8276 1595.4139 2973.8691 2981.2689 3064.2125 3079.9149 3093.7000 3102.9772 3138.8170 3140.2918 3164.9549 3167.7660
redmass: 1.0202 3.1548 4.8258 4.1711 1.1333 5.0898 4.4028 5.3266 6.3793 6.8200 5.0218 4.2557 8.0783 4.1277 2.8662 6.6467 4.4120 5.0095 6.5106 6.9614 3.3323 4.8189 1.6903 4.7146 1.2438 9.0345 12.8652 1.3006 1.3815 1.4410 5.4925 1.5985 2.4937 1.3466 1.2575 1.2859 1.1348 3.0849 1.2613 6.3234 2.9465 1.2174 1.1205 1.0484 1.1037 2.1889 1.0690 1.0830 6.0152 6.9572 1.0280 1.0390 1.0947 1.1059 1.1001 1.1027 1.0893 1.0895 1.0956 1.0970
irintensity: 0.3623 5.0839 1.3748 1.0501 0.1150 2.0479 2.9329 17.6781 3.3707 4.4419 4.0453 6.7439 3.7172 0.7665 0.0000 31.7089 46.4807 131.2604 50.7075 0.1387 1.3210 4.8498 95.9289 38.1109 0.4046 77.8978 80.9442 1.5395 0.0000 4.9274 2.0546 20.3561 24.5921 13.2609 0.1327 6.9264 9.2244 5.9581 2.4000 0.4380 11.2986 16.9728 0.7373 16.2981 17.2716 23.7683 11.2654 23.1421 15.3686 0.1252 45.2992 19.9633 18.6053 24.0187 14.3801 10.5019 13.4022 5.4548 0.3162 9.0243
temp: 298.150 k
press: 1.00000 atm
elementType: 16 8 8 8 6 6 6 6 6 6 6 6 1 1 1 1 1 1 1 1 1 1
symmnumber: 1
zpe: 428498.0 jmol-1
zpe.correction: 0.163206 hartree
zpe.thermalcorrener: 0.175850 hartree
zpe.thermalcorrenthalpy: 0.176794 hartree
zpe.thermalcorrgfe: 0.122690 hartree
zpe.sumelectzpe: -933.496653 hartree
zpe.sumelectthermal: -933.484009 hartree
zpe.sumelectthermalent: -933.483065 hartree
zpe.sumelectthermalfe: -933.537169 hartree
dipole: -4.2725 -0.0082 2.7140
dipole: 5.0616
quadrupole: -62.4024 -77.2840 -84.3463
quadrupole: -0.0361 8.1611 0.0069
quadrupole: 12.2752 -2.6065 -9.6687 -0.0361 8.1611 0.0069
hfenergy: -933.6598591 hartree
pointgroup: C01 [X(C8H10O3S1)]
dipole: -1.6595858 -0.0053402 -1.1006563 debye
dipolederiv: 2.0134837 0.0005702 0.0065224 -0.0003483 1.1824812 0.0016093 -0.2908277 0.0013816 1.5576622 -0.9714503 0.0003241 0.1570254 0.0006638 -0.4330962 -0.0009861 0.3006165 -0.0008204 -0.694995 -0.6984645 -0.0422529 -0.0444926 -0.0305634 -0.587558 -0.1506222 0.0358391 -0.0482781 -0.5551944 -0.6984661 0.0418311 -0.0450464 0.0305092 -0.5861796 0.1507192 0.0355835 0.0484783 -0.5565758 -0.0864883 -0.0000582 -0.0171771 -0.0001093 -0.1038452 -0.000448 -0.0847372 -0.0005945 -0.1964973 0.5437358 0.0011201 0.103065 0.0019227 0.027524 0.0001205 0.1760273 0.000077 0.0195199 -0.0981018 0.1043872 0.0175383 -0.2522209 -0.017026 -0.0226201 0.0044438 0.0320993 -0.0755215 -0.0987362 -0.1042441 0.0184385 0.2522894 -0.0170815 0.0220489 0.0020139 -0.0325155 -0.0756253 -0.2373176 -0.1381684 -0.0049083 -0.1360126 0.0554418 -0.0284719 -0.012645 -0.0295714 -0.1468499 -0.2374609 0.137772 -0.0061843 0.135467 0.0565247 0.0264763 -0.0139535 0.0276133 -0.1475517 -0.1907306 -0.000784 -0.0546676 -0.0033105 0.0760814 -0.0005963 -0.189262 -0.0004925 0.0184232 0.6290428 -0.000808 -0.2239371 0.0004488 0.2458982 -0.0005465 0.1834404 -0.0005009 0.0550068 0.1151993 -0.0653279 -0.0161511 -0.0437495 0.0650641 -0.0010553 -0.0051306 -0.0187549 0.1498954 0.1152328 0.0652881 -0.0167751 0.043655 0.0654599 0.0018688 -0.0055889 0.0195333 0.1497638 -0.0101434 0.0874281 -0.0185707 0.0796744 -0.0304643 0.0120064 -0.0242116 0.0103874 0.1518533 -0.0098707 -0.087532 -0.0176922 -0.0799122 -0.0308779 -0.010231 -0.023379 -0.0086204 0.1520127 0.0128247 -0.030617 0.0124399 -0.1073927 -0.0542167 0.0838352 0.072123 0.0733256 0.0807814 0.0134503 0.0306527 0.0116106 0.1094906 -0.0576439 -0.0809361 0.0698433 -0.0707558 0.083787 0.0036239 -0.0002181 -0.0320945 -0.0002997 0.1184817 -0.0024669 -0.0707811 -0.0022616 -0.1021969 -0.0433643 0.0385811 0.0422444 0.0998305 -0.0570071 0.056618 -0.0944037 0.0849535 0.0975318 -0.0429229 -0.0381531 0.0423629 -0.1001138 -0.0577295 -0.0559465 -0.094088 -0.0842949 0.0983051 -0.0230757 0.0002089 0.0864498 0.0000817 0.1397691 -0.0003755 0.0290776 -0.0003884 -0.0635348 unknown
polarizability: 172.6307354|0.0799991|115.2928834|3.4372824|-0.1689223|81.7280559 unknown
InChI: InChI=1S/C8H10O3S/c1-7-3-5-8(6-4-7)12(9,10)11-2/h3-6H,1-2H3
charge 0 multiplicity 1
22 atoms
S  1.837063 0.003108 0.581075
O  2.366688 -0.002461 -1.215536
O  2.293807 1.412088 1.242143
O  2.295982 -1.40074 1.251462
C  -0.004095 0.000668 0.262022
C  -2.767497 -0.002803 -0.166944
C  -0.658781 1.237748 0.156712
C  -0.657555 -1.238052 0.168791
C  -2.054227 1.220771 -0.056143
C  -2.052989 -1.224551 -0.044096
C  -4.262221 -0.004949 -0.427053
C  3.83799 -0.001879 -1.354869
H  -0.102013 2.174513 0.257994
H  -0.09978 -2.173212 0.279052
H  -2.594763 2.170533 -0.136986
H  -2.592616 -2.175594 -0.115541
H  -4.749395 -0.894129 0.008846
H  -4.74879 0.893422 -0.009806
H  -4.469913 -0.016334 -1.514609
H  4.283533 -0.909448 -0.908129
H  4.282506 0.908085 -0.911946
H  3.998567 -0.003987 -2.446039
