program: Orca
programVersion: 5.0.2
elementType: F F F F F F O O O N N N C C C C C C C C C C C C C C C C C C C C C C C C C H H H H H H H H H H H H H H H H H H H H H H H H H H H H H H H
charge: 0
multiplicity: 1
keywords: wb97x-d3
keywords: def2-TZVPP
keywords: def2/J RIJCOSX
keywords: DEFGRID2
keywords: scfconv7
keywords: smallprint printgap noloewdin
keywords: NOSOSCF
formula: C25H31F6N3O3
InChI: InChI=1/C25H31F6N3O3/c1-13(2)11-17-12-18(9-10-19(17)23(37-8,24(26,27)28)25(29,30)31)34(21(35)14(3)4)22(36)20-15(5)32-33(7)16(20)6/h9-10,12-14H,11H2,1-8H3
68 atoms
F  -3.227167 -1.075177 2.066919
F  -3.026768 -2.634545 0.610436
F  -4.860609 -1.519114 0.754765
F  -2.873758 -0.026895 -2.552975
F  -4.81646 -0.272713 -1.688053
F  -3.55081 -1.975221 -1.931634
O  -3.521596 0.820083 0.241005
O  4.499839 -2.297836 -0.655545
O  4.598188 0.145906 0.699568
N  2.766684 -0.950625 -0.097171
N  2.719877 3.547622 -0.887832
N  2.347218 2.941798 -2.024145
C  -2.967153 -0.380908 -0.183193
C  -1.430648 -0.459984 -0.12841
C  -0.650153 0.193688 0.850672
C  -1.133644 1.066383 1.995038
C  -0.314303 2.341798 2.250716
C  0.727641 -0.030467 0.835105
C  1.355486 -0.816837 -0.111348
C  -0.782477 -1.301866 -1.039159
C  -3.532759 -1.421426 0.820811
C  -3.552565 -0.679311 -1.608919
C  0.586145 -1.466739 -1.060823
C  -0.273814 3.271058 1.046037
C  -0.884228 3.065351 3.46486
C  3.384709 -2.205385 -0.193391
C  2.653164 -3.40665 0.362468
C  3.567632 0.201628 0.061359
C  3.083313 1.432742 -0.545861
C  -3.187432 2.012015 -0.464737
C  3.185504 2.694094 0.030003
C  2.544227 1.655138 -1.836474
C  3.376548 -3.81423 1.649844
C  2.621023 -4.545355 -0.647591
C  3.64643 3.12126 1.373022
C  2.265405 0.678147 -2.923407
C  2.618713 4.982783 -0.77009
H  -2.173937 1.349532 1.884573
H  -1.086848 0.456484 2.90308
H  0.714583 2.065552 2.49905
H  1.333293 0.419579 1.610481
H  -1.323246 -1.864659 -1.782143
H  1.037833 -2.096558 -1.816248
H  0.394797 4.113518 1.232619
H  0.076516 2.765855 0.144074
H  -1.261941 3.682128 0.833115
H  -0.88424 2.426216 4.349613
H  -1.913617 3.384731 3.285911
H  -0.299367 3.955691 3.701428
H  1.630771 -3.143889 0.630182
H  -3.838187 2.165847 -1.327056
H  -2.147365 2.030681 -0.790656
H  -3.348322 2.833162 0.229516
H  4.397624 -4.138841 1.448967
H  2.845195 -4.643192 2.11711
H  3.412588 -2.995504 2.369614
H  3.624892 -4.879786 -0.908897
H  2.10871 -4.256181 -1.565861
H  2.087115 -5.396285 -0.225323
H  3.716527 2.273576 2.049436
H  2.960943 3.844727 1.815369
H  4.630412 3.59076 1.322726
H  2.426497 1.136323 -3.898119
H  2.909671 -0.196616 -2.853211
H  1.232234 0.330639 -2.8939
H  2.251815 5.260121 0.215104
H  3.585852 5.457954 -0.931249
H  1.916911 5.344164 -1.515066
elementType: F O N C H
totalener: -1960.59397172 hartree
nucrepener: 4777.27819024 hartree
electener: -6737.87216196 hartree
twoeener: 5460.78359346 hartree
cpcmener: -0.05436540 hartree
kineticenergy: 1952.81061686 hartree
xcener: -178.402779085786 hartree
chargesum: 0.0000000
charge: -0.161822 -0.164168 -0.164851 -0.166492 -0.161455 -0.167952 -0.356483 -0.469101 -0.448192 0.063478 0.152609 -0.344815 0.219537 -0.079577 0.040613 -0.282891 0.171844 -0.209710 -0.061782 -0.048803 0.482169 0.518388 -0.297933 -0.380502 -0.312136 0.299583 0.052392 0.322172 -0.029237 -0.139160 -0.048576 0.064553 -0.293414 -0.275483 -0.264330 -0.295753 -0.175553 0.115216 0.114116 0.030893 0.155772 0.139274 0.181636 0.110655 0.091606 0.108353 0.092502 0.089089 0.093739 0.065608 0.123418 0.123160 0.129171 0.096155 0.102991 0.106798 0.090016 0.098869 0.101288 0.103522 0.111201 0.134296 0.113032 0.109446 0.112279 0.115051 0.136079 0.117600
qa: -0.1618 -0.1642 -0.1649 -0.1665 -0.1615 -0.1680 -0.3565 -0.4691 -0.4482 0.0635 0.1526 -0.3448 0.2195 -0.0796 0.0406 -0.2829 0.1718 -0.2097 -0.0618 -0.0488 0.4822 0.5184 -0.2979 -0.3805 -0.3121 0.2996 0.0524 0.3222 -0.0292 -0.1392 -0.0486 0.0646 -0.2934 -0.2755 -0.2643 -0.2958 -0.1756 0.1152 0.1141 0.0309 0.1558 0.1393 0.1816 0.1107 0.0916 0.1084 0.0925 0.0891 0.0937 0.0656 0.1234 0.1232 0.1292 0.0962 0.1030 0.1068 0.0900 0.0989 0.1013 0.1035 0.1112 0.1343 0.1130 0.1094 0.1123 0.1151 0.1361 0.1176
va: 1.1533 1.1482 1.1536 1.1390 1.1581 1.1428 1.9565 2.0221 2.0375 2.9685 3.3341 2.9204 4.0514 3.6528 3.6924 3.8295 3.6893 4.0076 3.7609 3.9205 4.4815 4.4282 4.0336 3.9630 3.9249 4.0573 3.8535 4.1163 3.3465 3.8610 3.9398 3.9385 3.9289 3.9215 3.9482 3.9852 3.8753 1.0194 1.0025 1.0277 0.9936 1.0317 0.9881 1.0026 0.9887 1.0083 1.0036 1.0023 1.0032 1.0207 1.0005 0.9781 0.9896 1.0110 1.0007 1.0037 1.0139 1.0060 1.0024 1.0074 0.9948 0.9931 1.0141 1.0029 0.9906 0.9942 0.9869 1.0062
dispcorr: -0.047952590 hartree
energy: -1960.641924309553
dipole: 49.56160 -51.08633 -1.52473 30.08139 -27.78810 2.29329 17.40147 -16.44545 0.95602
magnitude: 2.91512 au
magnitude: 7.40965 debye
