program: Orca
programVersion: 5.0.2
elementType: F F F F F F O O O N N N C C C C C C C C C C C C C C C C C C C C C C C C C H H H H H H H H H H H H H H H H H H H H H H H H H H H H H H H
charge: 0
multiplicity: 1
keywords: wb97x-d3
keywords: def2-TZVPP
keywords: def2/J RIJCOSX
keywords: DEFGRID2
keywords: scfconv7
keywords: smallprint printgap noloewdin
keywords: NOSOSCF
formula: C25H31F6N3O3
InChI: InChI=1/C25H31F6N3O3/c1-13(2)11-17-12-18(9-10-19(17)23(37-8,24(26,27)28)25(29,30)31)34(21(35)14(3)4)22(36)20-15(5)32-33(7)16(20)6/h9-10,12-14H,11H2,1-8H3
68 atoms
F  -4.182203 0.012484 -2.220533
F  -5.408881 -1.31201 -1.072953
F  -3.43303 -1.918809 -1.620038
F  -5.597557 1.084216 0.138939
F  -3.764934 2.022689 -0.484091
F  -4.085504 1.541413 1.581467
O  -4.139142 -1.064129 1.148182
O  2.451001 -1.568097 1.114406
O  2.117408 2.418664 -0.981812
N  2.115557 0.351956 -0.034046
N  5.300856 -0.120761 -2.843136
N  5.735891 1.149206 -2.807069
C  -3.619257 -0.280811 0.124319
C  -2.087827 -0.108492 0.144057
C  -1.337911 -0.0004 1.337058
C  -1.872966 -0.010189 2.756478
C  -1.016254 -0.742297 3.801839
C  0.039512 0.194241 1.225104
C  0.699464 0.224475 0.012368
C  -1.407951 0.000109 -1.073748
C  -4.160941 -0.875242 -1.222538
C  -4.278602 1.111097 0.339086
C  -0.036828 0.134762 -1.155153
C  -1.745401 -0.697623 5.139868
C  -0.697865 -2.181021 3.41725
C  2.896693 -0.500742 0.749782
C  4.220721 0.020667 1.268131
C  2.657181 1.334085 -0.892962
C  3.817997 0.949638 -1.669417
C  -3.687699 -2.410766 1.269071
C  4.155597 -0.304681 -2.179104
C  4.844601 1.819433 -2.116436
C  5.30633 -1.043108 1.223563
C  3.964838 0.493968 2.704891
C  3.472498 -1.622999 -2.157819
C  5.000806 3.27335 -1.854419
C  6.043778 -1.124682 -3.570625
H  -1.965275 1.031738 3.07875
H  -2.873917 -0.422567 2.804907
H  -0.070501 -0.208364 3.933881
H  0.619106 0.317793 2.130246
H  -1.921706 -0.026242 -2.020494
H  0.438844 0.165601 -2.126917
H  -1.962501 0.327469 5.445622
H  -2.69541 -1.23501 5.086491
H  -1.148774 -1.158318 5.92866
H  -0.090168 -2.657768 4.188357
H  -0.141958 -2.249991 2.480938
H  -1.609533 -2.77165 3.30693
H  4.551909 0.886846 0.697026
H  -4.248207 -3.086021 0.620254
H  -3.872323 -2.703739 2.299914
H  -2.622017 -2.517952 1.063347
H  6.232692 -0.633846 1.626361
H  5.508888 -1.377756 0.205754
H  5.042403 -1.915091 1.821867
H  4.882351 0.918539 3.112038
H  3.658593 -0.330561 3.349128
H  3.196757 1.267293 2.749352
H  3.929377 -2.299911 -1.433511
H  3.533335 -2.104754 -3.133927
H  2.418778 -1.522209 -1.913023
H  5.970769 3.620695 -2.206159
H  4.23102 3.856397 -2.360387
H  4.927878 3.495555 -0.788891
H  5.51057 -1.43567 -4.467967
H  6.999921 -0.700518 -3.859076
H  6.221655 -1.995954 -2.943877
elementType: F O N C H
totalener: -1960.59652153 hartree
nucrepener: 4623.89319934 hartree
electener: -6584.48972087 hartree
twoeener: 5309.09200588 hartree
cpcmener: -0.04937057 hartree
kineticenergy: 1952.77029975 hartree
xcener: -178.393225340023 hartree
chargesum: -0.0000000
charge: -0.168562 -0.161431 -0.166956 -0.165588 -0.163981 -0.161506 -0.355272 -0.463542 -0.447971 0.053024 0.159352 -0.346125 0.228459 -0.146839 0.101695 -0.291279 0.157134 -0.307577 0.126058 -0.069445 0.515682 0.482535 -0.245733 -0.314627 -0.337096 0.185175 0.115152 0.308919 -0.083867 -0.139450 -0.040943 0.071098 -0.293047 -0.298023 -0.243886 -0.266810 -0.172988 0.112599 0.115441 0.034058 0.149856 0.135157 0.149554 0.091975 0.087036 0.093720 0.103824 0.093894 0.088176 0.054838 0.121853 0.129596 0.122918 0.105584 0.099501 0.092142 0.109506 0.102389 0.105807 0.122748 0.129371 0.118155 0.098611 0.103735 0.109952 0.127926 0.111774 0.126567
qa: -0.1686 -0.1614 -0.1670 -0.1656 -0.1640 -0.1615 -0.3553 -0.4635 -0.4480 0.0530 0.1594 -0.3461 0.2285 -0.1468 0.1017 -0.2913 0.1571 -0.3076 0.1261 -0.0694 0.5157 0.4825 -0.2457 -0.3146 -0.3371 0.1852 0.1152 0.3089 -0.0839 -0.1394 -0.0409 0.0711 -0.2930 -0.2980 -0.2439 -0.2668 -0.1730 0.1126 0.1154 0.0341 0.1499 0.1352 0.1496 0.0920 0.0870 0.0937 0.1038 0.0939 0.0882 0.0548 0.1219 0.1296 0.1229 0.1056 0.0995 0.0921 0.1095 0.1024 0.1058 0.1227 0.1294 0.1182 0.0986 0.1037 0.1100 0.1279 0.1118 0.1266
va: 1.1421 1.1579 1.1376 1.1511 1.1470 1.1530 1.9578 2.0142 2.0338 2.9374 3.3164 2.9368 4.0321 3.7035 3.6803 3.8236 3.7172 4.0882 3.6950 3.9451 4.4350 4.4822 4.0747 3.9347 3.9324 4.1114 3.8067 4.0516 3.4571 3.8633 3.9508 3.9750 3.9206 3.9093 3.9206 3.9507 3.8851 1.0035 1.0143 1.0201 0.9950 1.0319 1.0068 1.0035 1.0021 1.0042 1.0066 1.0081 1.0042 1.0358 1.0010 0.9876 0.9799 1.0020 1.0010 1.0146 1.0012 1.0086 1.0035 0.9948 0.9967 1.0068 1.0151 0.9997 0.9929 0.9857 1.0115 0.9843
dispcorr: -0.044947799 hartree
energy: -1960.641469324761
dipole: 74.20042 -71.55945 2.64097 -17.58716 15.31667 -2.27049 30.67407 -30.67437 -0.00030
magnitude: 3.48280 au
magnitude: 8.85257 debye
