program: Orca
programVersion: 5.0.2
elementType: F F F F F F O O O N N N C C C C C C C C C C C C C C C C C C C C C C C C C H H H H H H H H H H H H H H H H H H H H H H H H H H H H H H H
charge: 0
multiplicity: 1
keywords: wb97x-d3
keywords: def2-TZVPP
keywords: def2/J RIJCOSX
keywords: DEFGRID2
keywords: scfconv7
keywords: smallprint printgap noloewdin
keywords: NOSOSCF
formula: C25H31F6N3O3
InChI: InChI=1/C25H31F6N3O3/c1-13(2)11-17-12-18(9-10-19(17)23(37-8,24(26,27)28)25(29,30)31)34(21(35)14(3)4)22(36)20-15(5)32-33(7)16(20)6/h9-10,12-14H,11H2,1-8H3
68 atoms
F  -3.975722 -1.782471 -1.887705
F  -5.067508 -2.488709 -0.191062
F  -3.012014 -3.041321 -0.430789
F  -3.766032 0.869085 -1.412041
F  -4.103381 1.466075 0.616872
F  -5.532566 0.213507 -0.373611
O  -3.955192 -0.987648 1.560737
O  4.272535 -0.785947 0.467605
O  1.942548 2.235679 -0.123265
N  2.233642 -0.012451 -0.172096
N  5.62396 1.424164 -2.477342
N  5.775681 2.572162 -1.79865
C  -3.456331 -0.791826 0.278874
C  -1.946153 -0.506962 0.205674
C  -1.209485 0.035405 1.277164
C  -1.743278 0.565785 2.593755
C  -1.177461 1.936635 3.004399
C  0.176844 0.127032 1.12403
C  0.817972 -0.182082 -0.055634
C  -1.281294 -0.782817 -0.995131
C  -3.877606 -2.038627 -0.580178
C  -4.228066 0.453555 -0.234743
C  0.078074 -0.602302 -1.145546
C  -1.415201 3.009697 1.948925
C  -1.796268 2.347253 4.335012
C  3.102668 -1.016223 0.244008
C  2.52618 -2.403613 0.443211
C  2.660874 1.308479 -0.44354
C  3.911888 1.517266 -1.144459
C  -3.449095 -2.064739 2.346178
C  4.524674 0.747459 -2.127925
C  4.740949 2.656623 -0.994669
C  2.367889 -2.66454 1.941595
C  3.439728 -3.439636 -0.204845
C  4.146393 -0.52762 -2.784647
C  4.578081 3.809101 -0.069841
C  6.572972 1.059723 -3.503595
H  -2.823772 0.650494 2.589283
H  -1.499074 -0.154733 3.381156
H  -0.098622 1.851663 3.161933
H  0.773277 0.474686 1.956949
H  -1.809136 -1.140806 -1.865061
H  0.557525 -0.819374 -2.090904
H  -0.974295 3.957957 2.260601
H  -0.971925 2.74988 0.986038
H  -2.480995 3.183655 1.791887
H  -1.398645 3.305259 4.67375
H  -1.595525 1.61169 5.115944
H  -2.880412 2.451747 4.248753
H  1.545842 -2.479778 -0.025411
H  -3.974007 -2.998373 2.137475
H  -3.634413 -1.798112 3.383896
H  -2.377908 -2.221997 2.216166
H  3.327952 -2.603989 2.455234
H  1.964796 -3.664855 2.099366
H  1.686073 -1.954657 2.411193
H  4.435194 -3.440173 0.238453
H  3.542575 -3.272978 -1.27779
H  3.013818 -4.433294 -0.065585
H  4.265453 -0.461993 -3.866675
H  3.107731 -0.780647 -2.586652
H  4.769395 -1.35352 -2.436676
H  5.49033 4.402376 -0.039194
H  3.764484 4.463823 -0.383812
H  4.355262 3.479948 0.945235
H  7.442298 1.702275 -3.408902
H  6.888294 0.025639 -3.383641
H  6.146649 1.187633 -4.497868
elementType: F O N C H
totalener: -1960.59671384 hartree
nucrepener: 4632.57176412 hartree
electener: -6593.16847797 hartree
twoeener: 5317.82530218 hartree
cpcmener: -0.05143794 hartree
kineticenergy: 1952.79256390 hartree
xcener: -178.396242308937 hartree
chargesum: 0.0000000
charge: -0.166392 -0.161196 -0.165515 -0.163870 -0.160831 -0.164660 -0.359726 -0.471640 -0.472180 0.001282 0.135068 -0.359817 0.226076 -0.029178 0.058380 -0.251031 0.127397 -0.383429 0.126910 -0.089575 0.513232 0.476594 -0.267187 -0.321779 -0.309541 0.250661 0.101347 0.381303 -0.102305 -0.136095 0.049621 0.075282 -0.303194 -0.291933 -0.276352 -0.268320 -0.172835 0.103818 0.107144 0.039627 0.149464 0.148701 0.157233 0.100719 0.088923 0.082402 0.092716 0.091556 0.085489 0.065598 0.118381 0.129437 0.124253 0.099777 0.103130 0.107451 0.090275 0.101236 0.103445 0.130730 0.106068 0.127132 0.097208 0.101105 0.108704 0.111046 0.125681 0.126979
qa: -0.1664 -0.1612 -0.1655 -0.1639 -0.1608 -0.1647 -0.3597 -0.4716 -0.4722 0.0013 0.1351 -0.3598 0.2261 -0.0292 0.0584 -0.2510 0.1274 -0.3834 0.1269 -0.0896 0.5132 0.4766 -0.2672 -0.3218 -0.3095 0.2507 0.1013 0.3813 -0.1023 -0.1361 0.0496 0.0753 -0.3032 -0.2919 -0.2764 -0.2683 -0.1728 0.1038 0.1071 0.0396 0.1495 0.1487 0.1572 0.1007 0.0889 0.0824 0.0927 0.0916 0.0855 0.0656 0.1184 0.1294 0.1243 0.0998 0.1031 0.1075 0.0903 0.1012 0.1034 0.1307 0.1061 0.1271 0.0972 0.1011 0.1087 0.1110 0.1257 0.1270
va: 1.1435 1.1571 1.1413 1.1479 1.1514 1.1518 1.9564 2.0253 2.0156 2.9540 3.3397 2.9373 4.0372 3.6549 3.5540 3.8147 3.7623 4.0848 3.6379 3.9290 4.4223 4.4780 4.1181 3.9290 3.9341 4.1390 3.7883 3.9946 3.5410 3.8689 3.8905 3.9887 3.9305 3.9206 3.9531 3.9558 3.8892 1.0279 0.9998 1.0228 1.0079 1.0254 1.0033 1.0050 1.0084 1.0109 1.0041 1.0037 1.0025 1.0234 1.0005 0.9881 0.9828 1.0081 1.0007 1.0011 1.0162 1.0024 1.0032 0.9954 1.0077 0.9910 1.0153 0.9994 0.9949 1.0115 0.9853 0.9853
dispcorr: -0.043752048 hartree
energy: -1960.640465892245
dipole: 61.68714 -61.15386 0.53328 6.01039 -9.13798 -3.12759 22.99134 -23.48428 -0.49294
magnitude: 3.21079 au
magnitude: 8.16119 debye
