program: Orca
programVersion: 5.0.2
elementType: F F F F F F O O O N N N C C C C C C C C C C C C C C C C C C C C C C C C C H H H H H H H H H H H H H H H H H H H H H H H H H H H H H H H
charge: 0
multiplicity: 1
keywords: wb97x-d3
keywords: def2-TZVPP
keywords: def2/J RIJCOSX
keywords: DEFGRID2
keywords: scfconv7
keywords: smallprint printgap noloewdin
keywords: NOSOSCF
formula: C25H31F6N3O3
InChI: InChI=1/C25H31F6N3O3/c1-13(2)11-17-12-18(9-10-19(17)23(37-8,24(26,27)28)25(29,30)31)34(21(35)14(3)4)22(36)20-15(5)32-33(7)16(20)6/h9-10,12-14H,11H2,1-8H3
68 atoms
F  -4.249823 -0.186641 -2.168927
F  -5.466304 -1.472482 -0.973694
F  -3.507268 -2.11452 -1.55692
F  -3.752455 1.827628 -0.509572
F  -3.91286 1.424451 1.587781
F  -5.554902 0.963245 0.292273
O  -4.155507 -1.203234 1.219575
O  2.431349 -2.127428 0.58958
O  2.06027 2.199801 -0.637751
N  2.107527 -0.013477 -0.13615
N  5.297715 0.199346 -2.983232
N  5.701134 1.442049 -2.672698
C  -3.629974 -0.459905 0.170535
C  -2.095527 -0.346684 0.155703
C  -1.305437 -0.396953 1.324847
C  -1.792707 -0.589918 2.749024
C  -1.066122 0.221299 3.831943
C  0.077949 -0.287966 1.174586
C  0.690471 -0.122601 -0.051433
C  -1.458263 -0.137199 -1.071448
C  -4.215056 -1.057982 -1.157599
C  -4.224494 0.958703 0.382296
C  -0.087373 -0.037427 -1.191255
C  -1.1389 1.722199 3.582895
C  -1.67402 -0.124976 5.186435
C  2.889535 -1.013815 0.445164
C  4.218022 -0.616932 1.052962
C  2.627796 1.132785 -0.767804
C  3.799172 0.949434 -1.60034
C  -3.787987 -2.575342 1.342752
C  4.161392 -0.153683 -2.373292
C  4.800814 1.921316 -1.84791
C  5.30677 -1.638597 0.764525
C  3.969624 -0.475987 2.560628
C  3.501169 -1.458017 -2.636151
C  4.922472 3.286142 -1.273274
C  6.046263 -0.586327 -3.93725
H  -2.85048 -0.374857 2.847075
H  -1.682126 -1.651851 2.993525
H  -0.013152 -0.071962 3.870031
H  0.702835 -0.326508 2.056837
H  -2.012333 -0.045067 -1.991794
H  0.35801 0.102836 -2.167719
H  -0.600944 2.26883 4.359021
H  -0.703009 2.006338 2.623869
H  -2.173398 2.071043 3.595636
H  -1.157987 0.396358 5.99403
H  -1.612267 -1.195305 5.391983
H  -2.727948 0.160235 5.229023
H  4.540427 0.355828 0.684916
H  -3.931498 -2.837885 2.388097
H  -2.746369 -2.761961 1.078654
H  -4.429902 -3.220004 0.740043
H  5.053087 -2.622161 1.160187
H  6.237651 -1.32356 1.23577
H  5.496127 -1.7398 -0.304422
H  3.686703 -1.428992 3.008303
H  3.186517 0.251034 2.780439
H  4.883327 -0.132847 3.04564
H  2.448407 -1.429072 -2.368416
H  3.974053 -2.267642 -2.07723
H  3.560276 -1.716062 -3.693736
H  4.813751 3.271832 -0.188449
H  5.895021 3.713623 -1.509945
H  4.156946 3.955207 -1.666943
H  5.547295 -0.610841 -4.905179
H  7.026417 -0.136408 -4.057804
H  6.17194 -1.604262 -3.575825
elementType: F O N C H
totalener: -1960.59764694 hartree
nucrepener: 4619.85804919 hartree
electener: -6580.45569613 hartree
twoeener: 5305.20068800 hartree
cpcmener: -0.05040092 hartree
kineticenergy: 1952.78451691 hartree
xcener: -178.395176599292 hartree
chargesum: -0.0000000
charge: -0.167436 -0.162230 -0.166137 -0.163882 -0.160789 -0.164815 -0.358169 -0.458370 -0.458585 0.052542 0.154308 -0.344250 0.226600 -0.048227 0.005079 -0.259811 0.122608 -0.230402 0.069337 -0.119166 0.514448 0.479333 -0.214963 -0.313023 -0.313807 0.175013 0.118807 0.323608 -0.084839 -0.137906 -0.042300 0.070974 -0.293418 -0.301226 -0.241439 -0.268915 -0.174136 0.103300 0.103962 0.035779 0.152706 0.145549 0.151992 0.098559 0.095995 0.081498 0.093607 0.091673 0.086651 0.055145 0.129597 0.124447 0.117752 0.092695 0.105943 0.100083 0.103224 0.104931 0.110578 0.116745 0.122330 0.130517 0.109818 0.098927 0.104472 0.128405 0.112742 0.125958
qa: -0.1674 -0.1622 -0.1661 -0.1639 -0.1608 -0.1648 -0.3582 -0.4584 -0.4586 0.0525 0.1543 -0.3442 0.2266 -0.0482 0.0051 -0.2598 0.1226 -0.2304 0.0693 -0.1192 0.5144 0.4793 -0.2150 -0.3130 -0.3138 0.1750 0.1188 0.3236 -0.0848 -0.1379 -0.0423 0.0710 -0.2934 -0.3012 -0.2414 -0.2689 -0.1741 0.1033 0.1040 0.0358 0.1527 0.1455 0.1520 0.0986 0.0960 0.0815 0.0936 0.0917 0.0867 0.0551 0.1296 0.1244 0.1178 0.0927 0.1059 0.1001 0.1032 0.1049 0.1106 0.1167 0.1223 0.1305 0.1098 0.0989 0.1045 0.1284 0.1127 0.1260
va: 1.1425 1.1565 1.1403 1.1483 1.1497 1.1528 1.9573 2.0233 2.0223 2.9330 3.3202 2.9373 4.0394 3.6378 3.6692 3.7984 3.7890 4.0557 3.7469 3.9814 4.4273 4.4763 4.0659 3.9252 3.9330 4.1289 3.8041 4.0415 3.4697 3.8713 3.9458 3.9746 3.9205 3.9109 3.9195 3.9538 3.8878 1.0265 0.9976 1.0203 0.9922 1.0270 1.0048 1.0057 1.0042 1.0089 1.0040 1.0036 1.0025 1.0365 0.9876 0.9825 1.0001 1.0138 1.0023 1.0011 1.0092 1.0032 1.0014 1.0078 0.9939 0.9955 0.9933 1.0150 0.9990 0.9850 1.0104 0.9853
dispcorr: -0.044153700 hartree
energy: -1960.641800635453
dipole: 73.18838 -70.58774 2.60064 -7.98891 5.78328 -2.20564 28.75000 -29.01768 -0.26768
magnitude: 3.42050 au
magnitude: 8.69422 debye
