program: Orca
programVersion: 5.0.2
elementType: F F F F F F O O O N N N C C C C C C C C C C C C C C C C C C C C C C C C C H H H H H H H H H H H H H H H H H H H H H H H H H H H H H H H
charge: 0
multiplicity: 1
keywords: wb97x-d3
keywords: def2-TZVPP
keywords: def2/J RIJCOSX
keywords: DEFGRID2
keywords: scfconv7
keywords: smallprint printgap noloewdin
keywords: NOSOSCF
formula: C25H31F6N3O3
InChI: InChI=1/C25H31F6N3O3/c1-13(2)11-17-12-18(9-10-19(17)23(37-8,24(26,27)28)25(29,30)31)34(21(35)14(3)4)22(36)20-15(5)32-33(7)16(20)6/h9-10,12-14H,11H2,1-8H3
68 atoms
F  -3.052424 2.963203 -0.098216
F  -4.292965 1.837533 -1.424209
F  -2.182044 1.947425 -1.78356
F  -4.990015 1.021621 1.097937
F  -3.190959 1.530029 2.161721
F  -3.773669 -0.522002 1.951968
O  -3.536145 -0.497924 -0.682133
O  2.504922 -1.332997 2.758068
O  4.652057 0.902583 0.374355
N  2.732483 -0.257514 0.788222
N  2.042311 1.112644 -3.237674
N  2.552453 2.332023 -3.009341
C  -2.909026 0.529997 0.012572
C  -1.435883 0.259534 0.35666
C  -0.902325 -1.038026 0.484027
C  -1.653864 -2.354159 0.50581
C  -1.241363 -3.297309 1.650996
C  0.48268 -1.15805 0.602239
C  1.321822 -0.068941 0.713421
C  -0.580358 1.351729 0.538572
C  -3.104011 1.844322 -0.826133
C  -3.729433 0.648171 1.322691
C  0.774802 1.202721 0.744914
C  -1.348308 -2.644107 3.023308
C  -2.099553 -4.555018 1.590514
C  3.224497 -1.085447 1.81703
C  4.57871 -1.743034 1.637207
C  3.560923 0.537657 -0.01871
C  3.029454 0.954162 -1.309287
C  -3.015225 -0.899531 -1.947035
C  2.289397 0.245106 -2.248182
C  3.173173 2.252959 -1.854086
C  4.589677 -2.54946 0.334298
C  4.907898 -2.635995 2.825048
C  1.851076 -1.168656 -2.326072
C  3.854935 3.431383 -1.257787
C  1.299843 0.841681 -4.446392
H  -2.726657 -2.213427 0.566899
H  -1.472707 -2.873081 -0.441478
H  -0.202371 -3.606704 1.504781
H  0.916706 -2.149264 0.595798
H  -0.948815 2.365431 0.535982
H  1.394814 2.077075 0.893149
H  -0.720748 -1.755676 3.110007
H  -2.375858 -2.351788 3.245743
H  -1.032801 -3.339074 3.803269
H  -1.803667 -5.268954 2.360825
H  -2.011065 -5.056584 0.624889
H  -3.15475 -4.318772 1.746463
H  5.344323 -0.970567 1.574545
H  -3.420738 -0.29436 -2.75954
H  -3.336833 -1.927096 -2.097263
H  -1.925585 -0.869283 -1.991935
H  5.537672 -3.080059 0.246487
H  4.484544 -1.931714 -0.557084
H  3.790783 -3.29313 0.326211
H  5.904664 -3.055008 2.688437
H  4.210365 -3.469329 2.916542
H  4.911575 -2.087765 3.766772
H  0.764795 -1.253715 -2.256372
H  2.290296 -1.764047 -1.530706
H  2.153684 -1.614328 -3.275257
H  3.543851 3.590454 -0.224589
H  4.938687 3.311016 -1.254894
H  3.62057 4.332254 -1.822128
H  1.76358 0.037065 -5.014848
H  0.272241 0.564361 -4.216321
H  1.293749 1.740286 -5.054424
elementType: F O N C H
totalener: -1960.59534427 hartree
nucrepener: 4775.69072848 hartree
electener: -6736.28607275 hartree
twoeener: 5459.73490056 hartree
cpcmener: -0.04996518 hartree
kineticenergy: 1952.78831584 hartree
xcener: -178.397324421778 hartree
chargesum: 0.0000000
charge: -0.166969 -0.161953 -0.166059 -0.165283 -0.164653 -0.161437 -0.360441 -0.450208 -0.460961 0.051257 0.152137 -0.355895 0.231841 -0.002319 -0.024539 -0.256510 0.133178 -0.252422 0.066459 -0.108773 0.511487 0.477818 -0.270165 -0.321711 -0.312256 0.290378 0.093456 0.273114 -0.067889 -0.123872 0.015350 0.062978 -0.312686 -0.306235 -0.274863 -0.268174 -0.165326 0.101288 0.105099 0.038172 0.155039 0.149225 0.156734 0.090159 0.082284 0.099600 0.093189 0.091285 0.085982 0.082987 0.120580 0.130216 0.107686 0.110641 0.103660 0.102489 0.098096 0.090403 0.099134 0.123831 0.102008 0.138227 0.106041 0.104161 0.098703 0.123687 0.121474 0.110070
qa: -0.1670 -0.1620 -0.1661 -0.1653 -0.1647 -0.1614 -0.3604 -0.4502 -0.4610 0.0513 0.1521 -0.3559 0.2318 -0.0023 -0.0245 -0.2565 0.1332 -0.2524 0.0665 -0.1088 0.5115 0.4778 -0.2702 -0.3217 -0.3123 0.2904 0.0935 0.2731 -0.0679 -0.1239 0.0153 0.0630 -0.3127 -0.3062 -0.2749 -0.2682 -0.1653 0.1013 0.1051 0.0382 0.1550 0.1492 0.1567 0.0902 0.0823 0.0996 0.0932 0.0913 0.0860 0.0830 0.1206 0.1302 0.1077 0.1106 0.1037 0.1025 0.0981 0.0904 0.0991 0.1238 0.1020 0.1382 0.1060 0.1042 0.0987 0.1237 0.1215 0.1101
va: 1.1435 1.1564 1.1393 1.1519 1.1476 1.1499 1.9569 2.0388 2.0223 2.9569 3.3218 2.9359 4.0283 3.5751 3.6085 3.8226 3.7553 3.8713 3.6809 3.9424 4.4281 4.4768 4.1063 3.9283 3.9359 4.0702 3.7111 4.1132 3.4659 3.8740 3.9321 3.9751 3.9291 3.9606 3.9963 3.9571 3.8853 1.0297 1.0017 1.0232 0.9928 1.0231 1.0024 1.0072 1.0109 1.0049 1.0042 1.0035 1.0021 1.0388 1.0013 0.9889 0.9791 1.0037 1.0010 1.0007 1.0038 1.0048 1.0073 0.9785 1.0025 0.9942 0.9945 0.9995 1.0149 0.9888 0.9854 1.0124
dispcorr: -0.046420126 hartree
energy: -1960.641764392926
dipole: 50.55516 -50.46357 0.09159 -47.13592 44.66688 -2.46904 -4.51024 1.42322 -3.08702
magnitude: 3.95402 au
magnitude: 10.05031 debye
