program: Orca
programVersion: 5.0.2
elementType: F F F F F F O O O N N N C C C C C C C C C C C C C C C C C C C C C C C C C H H H H H H H H H H H H H H H H H H H H H H H H H H H H H H H
charge: 0
multiplicity: 1
keywords: wb97x-d3
keywords: def2-TZVPP
keywords: def2/J RIJCOSX
keywords: DEFGRID2
keywords: scfconv7
keywords: smallprint printgap noloewdin
keywords: NOSOSCF
formula: C25H31F6N3O3
InChI: InChI=1/C25H31F6N3O3/c1-13(2)11-17-12-18(9-10-19(17)23(37-8,24(26,27)28)25(29,30)31)34(21(35)14(3)4)22(36)20-15(5)32-33(7)16(20)6/h9-10,12-14H,11H2,1-8H3
68 atoms
F  -4.16123 0.085446 -2.229231
F  -5.422546 -1.228067 -1.108106
F  -3.45489 -1.868572 -1.650859
F  -5.574884 1.133188 0.190901
F  -3.741605 2.056496 -0.454778
F  -4.027498 1.548787 1.609031
O  -4.156279 -1.050848 1.121888
O  2.463511 -1.603032 1.107492
O  2.14359 2.431184 -0.896311
N  2.121236 0.333367 -0.013562
N  5.256537 -0.110302 -2.877442
N  5.689786 1.1587 -2.848342
C  -3.618372 -0.258269 0.118034
C  -2.084792 -0.111987 0.146633
C  -1.334763 -0.054527 1.342768
C  -1.865169 -0.119043 2.762742
C  -1.02228 -0.929733 3.762458
C  0.04383 0.13686 1.239194
C  0.706248 0.209303 0.029938
C  -1.402326 0.035141 -1.065517
C  -4.164896 -0.815503 -1.242943
C  -4.252399 1.139849 0.364527
C  -0.030875 0.165059 -1.14035
C  -1.749334 -0.954681 5.102418
C  -0.720627 -2.3471 3.293054
C  2.905885 -0.53398 0.750762
C  4.237304 -0.020061 1.261282
C  2.662156 1.337133 -0.85353
C  3.800446 0.953944 -1.665256
C  -3.7466 -2.41073 1.214914
C  4.124661 -0.297441 -2.190985
C  4.816562 1.826116 -2.133404
C  5.322331 -1.083035 1.187936
C  3.997389 0.436598 2.705824
C  3.443125 -1.61752 -2.164697
C  4.977568 3.281842 -1.881548
C  5.98583 -1.102428 -3.631329
H  -1.922814 0.907915 3.137679
H  -2.879218 -0.499391 2.797244
H  -0.068045 -0.419663 3.926438
H  0.621882 0.225475 2.149224
H  -1.915893 0.045967 -2.01288
H  0.444647 0.230762 -2.110559
H  -1.950391 0.053208 5.471265
H  -2.70829 -1.473128 5.020933
H  -1.159365 -1.470638 5.862052
H  -0.113464 -2.873704 4.031893
H  -0.168088 -2.368146 2.352587
H  -1.636611 -2.924892 3.154722
H  4.56399 0.852857 0.697586
H  -2.686766 -2.549717 0.997944
H  -4.33379 -3.058181 0.560583
H  -3.933449 -2.71697 2.24202
H  6.256445 -0.681102 1.581577
H  5.511551 -1.40302 0.162183
H  5.067303 -1.96455 1.776602
H  4.914517 0.867879 3.108098
H  3.706288 -0.39635 3.346925
H  3.222324 1.202769 2.766614
H  3.914132 -2.302757 -1.45727
H  3.479733 -2.091112 -3.146419
H  2.39503 -1.521922 -1.895238
H  4.898449 3.517299 -0.820337
H  5.951195 3.619851 -2.231796
H  4.214601 3.864143 -2.398263
H  5.44647 -1.387498 -4.53437
H  6.943908 -0.677216 -3.913694
H  6.161162 -1.99053 -3.02718
elementType: F O N C H
totalener: -1960.60796820 hartree
nucrepener: 4624.32441298 hartree
electener: -6584.93238118 hartree
twoeener: 5309.41250003 hartree
cpcmener: -0.04054664 hartree
kineticenergy: 1952.77411510 hartree
xcener: -178.391650242580 hartree
chargesum: 0.0000000
charge: -0.168113 -0.160615 -0.167727 -0.164460 -0.163297 -0.161603 -0.345151 -0.432356 -0.410767 0.053610 0.158402 -0.340926 0.225383 -0.141588 0.100924 -0.295425 0.151053 -0.307832 0.140138 -0.075395 0.514425 0.482489 -0.240864 -0.310866 -0.333277 0.157715 0.112553 0.276525 -0.082072 -0.144927 -0.046349 0.074228 -0.291009 -0.297305 -0.243466 -0.262837 -0.174677 0.113884 0.115852 0.033886 0.143843 0.135188 0.144351 0.092087 0.085803 0.093026 0.102632 0.095386 0.086109 0.053793 0.123236 0.120980 0.127317 0.104463 0.096052 0.093769 0.107989 0.102386 0.104546 0.121380 0.128000 0.117339 0.105755 0.098670 0.103970 0.126246 0.113240 0.124281
qa: -0.1681 -0.1606 -0.1677 -0.1645 -0.1633 -0.1616 -0.3452 -0.4324 -0.4108 0.0536 0.1584 -0.3409 0.2254 -0.1416 0.1009 -0.2954 0.1511 -0.3078 0.1401 -0.0754 0.5144 0.4825 -0.2409 -0.3109 -0.3333 0.1577 0.1126 0.2765 -0.0821 -0.1449 -0.0463 0.0742 -0.2910 -0.2973 -0.2435 -0.2628 -0.1747 0.1139 0.1159 0.0339 0.1438 0.1352 0.1444 0.0921 0.0858 0.0930 0.1026 0.0954 0.0861 0.0538 0.1232 0.1210 0.1273 0.1045 0.0961 0.0938 0.1080 0.1024 0.1045 0.1214 0.1280 0.1173 0.1058 0.0987 0.1040 0.1262 0.1132 0.1243
va: 1.1429 1.1592 1.1366 1.1534 1.1486 1.1532 1.9670 2.0545 2.0770 2.9157 3.3121 2.9337 4.0404 3.7078 3.6777 3.8258 3.7234 4.0988 3.7086 3.9581 4.4349 4.4827 4.0715 3.9360 3.9312 4.1489 3.8014 4.0811 3.4468 3.8701 3.9454 3.9760 3.9210 3.9101 3.9223 3.9544 3.8867 1.0033 1.0143 1.0195 0.9963 1.0318 1.0082 1.0037 1.0026 1.0044 1.0072 1.0089 1.0045 1.0343 0.9790 1.0012 0.9875 1.0024 1.0016 1.0145 1.0016 1.0086 1.0035 0.9951 0.9966 1.0084 0.9946 1.0148 0.9990 0.9855 1.0119 0.9846
dispcorr: -0.044934929 hartree
energy: -1960.652903133414
dipole: 73.78246 -71.28862 2.49384 -19.40245 17.21492 -2.18752 29.80943 -29.88581 -0.07637
magnitude: 3.31818 au
magnitude: 8.43415 debye
