program: Orca
programVersion: 5.0.2
elementType: F F F F F F O O O N N N C C C C C C C C C C C C C C C C C C C C C C C C C H H H H H H H H H H H H H H H H H H H H H H H H H H H H H H H
charge: 0
multiplicity: 1
keywords: wb97x-d3
keywords: def2-TZVPP
keywords: def2/J RIJCOSX
keywords: DEFGRID2
keywords: scfconv7
keywords: smallprint printgap noloewdin
keywords: NOSOSCF
formula: C25H31F6N3O3
InChI: InChI=1/C25H31F6N3O3/c1-13(2)11-17-12-18(9-10-19(17)23(37-8,24(26,27)28)25(29,30)31)34(21(35)14(3)4)22(36)20-15(5)32-33(7)16(20)6/h9-10,12-14H,11H2,1-8H3
68 atoms
F  -4.766126 -2.507138 1.442579
F  -2.660541 -2.698026 1.787082
F  -3.488571 -3.148574 -0.145777
F  -5.46876 -0.93065 -0.680362
F  -3.665205 -1.116675 -1.842991
F  -4.240628 0.785755 -1.045423
O  -4.033984 -0.047893 1.478191
O  3.817914 1.541515 -1.313282
O  2.421122 0.111537 1.970877
N  2.204504 0.330183 -0.271789
N  6.251254 -1.225186 0.151528
N  6.481898 -0.700346 1.363873
C  -3.390987 -0.798689 0.506239
C  -1.92194 -0.411868 0.257504
C  -1.415883 0.885582 0.486282
C  -2.186913 2.111287 0.942668
C  -1.84419 3.417441 0.208009
C  -0.042188 1.07868 0.315423
C  0.802416 0.086899 -0.135304
C  -1.054771 -1.393587 -0.2341
C  -3.570798 -2.312518 0.892302
C  -4.205619 -0.516985 -0.784243
C  0.29065 -1.161407 -0.433064
C  -2.148924 3.345897 -1.283131
C  -2.60749 4.566367 0.857302
C  2.700185 1.075749 -1.336151
C  1.784456 1.299312 -2.525833
C  2.968671 0.051032 0.889939
C  4.353827 -0.354656 0.754577
C  -3.531838 -0.062004 2.810772
C  4.99306 -1.051781 -0.266688
C  5.343422 -0.179087 1.756141
C  2.501125 0.877331 -3.806446
C  1.386437 2.774133 -2.579602
C  4.517953 -1.595974 -1.562752
C  5.234005 0.506858 3.071426
C  7.299938 -1.951839 -0.522715
H  -3.259263 1.970759 0.869796
H  -1.975757 2.256637 2.007697
H  -0.779227 3.636955 0.327288
H  0.386276 2.045488 0.542871
H  -1.403818 -2.382193 -0.486616
H  0.929305 -1.946981 -0.8150
H  -1.816942 4.254341 -1.789203
H  -1.652783 2.504519 -1.76976
H  -3.221468 3.249938 -1.462746
H  -2.367182 4.659838 1.91834
H  -3.687664 4.422961 0.77458
H  -2.365261 5.518266 0.381145
H  0.879696 0.699249 -2.434009
H  -3.937957 -0.89601 3.386397
H  -3.870182 0.861716 3.275144
H  -2.442341 -0.093956 2.858336
H  3.404513 1.463015 -3.977606
H  1.839614 1.028977 -4.660041
H  2.775564 -0.178262 -3.789882
H  2.260065 3.412807 -2.717253
H  0.874722 3.096601 -1.671782
H  0.712278 2.946317 -3.418972
H  4.877978 -0.998494 -2.402459
H  3.43221 -1.619754 -1.606067
H  4.869581 -2.617602 -1.713419
H  4.778285 1.492681 2.975856
H  4.625147 -0.063509 3.773474
H  6.222374 0.632874 3.511177
H  7.155465 -3.028546 -0.431364
H  7.334368 -1.686231 -1.577194
H  8.248075 -1.684481 -0.065837
elementType: F O N C H
totalener: -1960.60983777 hartree
nucrepener: 4627.10203637 hartree
electener: -6587.71187414 hartree
twoeener: 5311.99149529 hartree
cpcmener: -0.04098995 hartree
kineticenergy: 1952.78625146 hartree
xcener: -178.392402668157 hartree
chargesum: 0.0000000
charge: -0.160346 -0.165707 -0.166678 -0.163265 -0.164258 -0.160096 -0.348739 -0.442921 -0.435896 0.004052 0.134127 -0.352885 0.220561 -0.021121 0.029121 -0.252621 0.127689 -0.310317 0.069985 -0.104363 0.510578 0.477021 -0.224011 -0.344610 -0.310626 0.219676 0.117995 0.351792 -0.094888 -0.142050 0.055006 0.073013 -0.296749 -0.326603 -0.281411 -0.263761 -0.176461 0.104915 0.106373 0.035232 0.150401 0.147776 0.148489 0.107333 0.095365 0.092038 0.090981 0.086729 0.093356 0.056475 0.118655 0.127887 0.123942 0.094780 0.104086 0.097664 0.108818 0.097541 0.108342 0.127504 0.098435 0.130815 0.106258 0.099477 0.097749 0.125677 0.123296 0.113379
qa: -0.1603 -0.1657 -0.1667 -0.1633 -0.1643 -0.1601 -0.3487 -0.4429 -0.4359 0.0041 0.1341 -0.3529 0.2206 -0.0211 0.0291 -0.2526 0.1277 -0.3103 0.0700 -0.1044 0.5106 0.4770 -0.2240 -0.3446 -0.3106 0.2197 0.1180 0.3518 -0.0949 -0.1420 0.0550 0.0730 -0.2967 -0.3266 -0.2814 -0.2638 -0.1765 0.1049 0.1064 0.0352 0.1504 0.1478 0.1485 0.1073 0.0954 0.0920 0.0910 0.0867 0.0934 0.0565 0.1187 0.1279 0.1239 0.0948 0.1041 0.0977 0.1088 0.0975 0.1083 0.1275 0.0984 0.1308 0.1063 0.0995 0.0977 0.1257 0.1233 0.1134
va: 1.1586 1.1411 1.1437 1.1557 1.1480 1.1500 1.9672 2.0673 2.0596 2.9306 3.3377 2.9316 4.0562 3.6657 3.6072 3.8119 3.7664 4.1476 3.7127 3.9509 4.4290 4.4780 4.1038 3.9347 3.9359 4.1703 3.7623 4.0381 3.5395 3.8756 3.8862 3.9944 3.9279 3.9419 3.9513 3.9531 3.8928 1.0294 0.9977 1.0267 1.0058 1.0276 1.0056 1.0016 0.9970 1.0134 1.0037 1.0027 1.0040 1.0296 1.0001 0.9877 0.9829 1.0151 1.0035 1.0025 1.0144 0.9993 0.9977 0.9908 1.0085 0.9950 0.9956 1.0003 1.0153 0.9845 0.9859 1.0110
dispcorr: -0.044339596 hartree
energy: -1960.654177365903
dipole: 52.91555 -52.69608 0.21947 40.83811 -41.39729 -0.55917 -9.57311 7.98455 -1.58856
magnitude: 1.69835 au
magnitude: 4.31685 debye
