program: Orca
programVersion: 5.0.2
elementType: F F F F F F O O O N N N C C C C C C C C C C C C C C C C C C C C C C C C C H H H H H H H H H H H H H H H H H H H H H H H H H H H H H H H
charge: 0
multiplicity: 1
keywords: wb97x-d3
keywords: def2-TZVPP
keywords: def2/J RIJCOSX
keywords: DEFGRID2
keywords: scfconv7
keywords: smallprint printgap noloewdin
keywords: NOSOSCF
formula: C25H31F6N3O3
InChI: InChI=1/C25H31F6N3O3/c1-13(2)11-17-12-18(9-10-19(17)23(37-8,24(26,27)28)25(29,30)31)34(21(35)14(3)4)22(36)20-15(5)32-33(7)16(20)6/h9-10,12-14H,11H2,1-8H3
68 atoms
F  -4.313326 0.184762 -2.052197
F  -5.49048 -1.266399 -1.019096
F  -3.537754 -1.794877 -1.72704
F  -3.926616 1.241105 1.909916
F  -5.593297 0.944332 0.596689
F  -3.829472 1.95829 -0.105696
O  -4.136569 -1.295425 1.16509
O  2.151731 1.588612 1.575363
O  2.272597 -1.6736 -1.515162
N  2.090097 0.11517 -0.132516
N  5.50124 0.389074 -3.198183
N  5.052054 1.620475 -2.9151
C  -3.644597 -0.40195 0.224037
C  -2.111335 -0.263745 0.199736
C  -1.289954 -0.5493 1.310486
C  -1.727284 -0.915761 2.717026
C  -0.969011 -0.183078 3.839817
C  0.092296 -0.479218 1.127737
C  0.673798 -0.009043 -0.031476
C  -1.504481 0.202719 -0.97194
C  -4.247235 -0.814056 -1.168407
C  -4.26117 0.955336 0.655735
C  -0.138162 0.359994 -1.089608
C  -1.028626 1.333626 3.704283
C  -1.534154 -0.621069 5.186178
C  2.760675 0.80391 0.88333
C  4.190601 0.409184 1.192567
C  2.70691 -0.587239 -1.193378
C  3.782247 0.079442 -1.903399
C  -3.770021 -2.66834 1.085652
C  4.773679 -0.575963 -2.63169
C  4.015354 1.463719 -2.125477
C  4.13976 -0.909341 1.975833
C  4.906305 1.494033 1.980938
C  5.073213 -2.017681 -2.807772
C  3.261465 2.653899 -1.643726
C  6.661177 0.224954 -4.042798
H  -2.785811 -0.737821 2.869604
H  -1.579497 -1.991967 2.856332
H  0.083114 -0.482462 3.82187
H  0.735652 -0.777821 1.944585
H  -2.087029 0.490985 -1.833095
H  0.281719 0.760214 -2.003605
H  -0.448222 1.812946 4.494849
H  -0.625832 1.684207 2.75306
H  -2.053737 1.699427 3.788424
H  -0.980261 -0.167794 6.010403
H  -1.482474 -1.704398 5.312858
H  -2.580891 -0.325084 5.291525
H  4.747507 0.223793 0.275337
H  -3.880647 -3.073016 2.089464
H  -2.738743 -2.820728 0.764288
H  -4.434935 -3.225996 0.423323
H  3.579526 -0.797758 2.905801
H  5.153308 -1.217962 2.233538
H  3.688458 -1.718777 1.400818
H  4.457736 1.651498 2.961968
H  4.909945 2.448105 1.452149
H  5.945723 1.203897 2.13684
H  4.591501 -2.410441 -3.705599
H  4.71345 -2.598817 -1.962326
H  6.144087 -2.194891 -2.904255
H  3.540622 2.933688 -0.626108
H  3.479428 3.511708 -2.278889
H  2.184794 2.489586 -1.658035
H  6.428263 -0.39811 -4.904749
H  6.966933 1.206537 -4.391301
H  7.486208 -0.224371 -3.491296
elementType: F O N C H
totalener: -1960.60814674 hartree
nucrepener: 4616.67612105 hartree
electener: -6577.28426779 hartree
twoeener: 5302.76616276 hartree
cpcmener: -0.04022401 hartree
kineticenergy: 1952.75471417 hartree
xcener: -178.387121144204 hartree
chargesum: -0.0000000
charge: -0.166459 -0.162067 -0.166149 -0.161028 -0.164163 -0.163809 -0.349495 -0.430163 -0.424376 0.051435 0.148856 -0.351433 0.225681 -0.034796 0.029010 -0.269963 0.129076 -0.276123 0.115821 -0.117472 0.511261 0.476289 -0.227095 -0.315098 -0.310177 0.153918 0.085734 0.273853 -0.118633 -0.141731 0.043186 0.074014 -0.295700 -0.290025 -0.259310 -0.266887 -0.177195 0.103171 0.104692 0.035074 0.146566 0.147299 0.146180 0.098867 0.089862 0.083371 0.093200 0.089728 0.086336 0.089868 0.127106 0.123508 0.118233 0.101533 0.108163 0.106403 0.088366 0.101832 0.101697 0.123115 0.104787 0.107846 0.102701 0.110122 0.116113 0.128687 0.110726 0.126063
qa: -0.1665 -0.1621 -0.1661 -0.1610 -0.1642 -0.1638 -0.3495 -0.4302 -0.4244 0.0514 0.1489 -0.3514 0.2257 -0.0348 0.0290 -0.2700 0.1291 -0.2761 0.1158 -0.1175 0.5113 0.4763 -0.2271 -0.3151 -0.3102 0.1539 0.0857 0.2739 -0.1186 -0.1417 0.0432 0.0740 -0.2957 -0.2900 -0.2593 -0.2669 -0.1772 0.1032 0.1047 0.0351 0.1466 0.1473 0.1462 0.0989 0.0899 0.0834 0.0932 0.0897 0.0863 0.0899 0.1271 0.1235 0.1182 0.1015 0.1082 0.1064 0.0884 0.1018 0.1017 0.1231 0.1048 0.1078 0.1027 0.1101 0.1161 0.1287 0.1107 0.1261
va: 1.1441 1.1561 1.1407 1.1503 1.1540 1.1490 1.9659 2.0550 2.0593 2.9162 3.3423 2.9396 4.0367 3.6374 3.5846 3.8228 3.7700 4.0934 3.6835 3.9890 4.4264 4.4792 4.0927 3.9255 3.9391 4.1617 3.7816 4.0727 3.5125 3.8760 3.9252 3.9501 3.9033 3.9465 3.9612 3.9655 3.8867 1.0267 0.9993 1.0227 0.9919 1.0243 1.0069 1.0052 1.0118 1.0106 1.0042 1.0038 1.0028 1.0075 0.9876 0.9828 1.0003 1.0038 1.0019 1.0070 1.0117 1.0024 1.0026 0.9911 1.0053 0.9978 0.9967 1.0160 0.9949 0.9836 1.0130 0.9846
dispcorr: -0.044170164 hartree
energy: -1960.652316901765
dipole: 75.88868 -72.35977 3.52890 -6.29117 4.38300 -1.90817 27.03925 -27.65628 -0.61703
magnitude: 4.05894 au
magnitude: 10.31700 debye
