program: Orca
programVersion: 5.0.2
elementType: F F F F F F O O O N N N C C C C C C C C C C C C C C C C C C C C C C C C C H H H H H H H H H H H H H H H H H H H H H H H H H H H H H H H
charge: 0
multiplicity: 1
keywords: wb97x-d3
keywords: def2-TZVPP
keywords: def2/J RIJCOSX
keywords: DEFGRID2
keywords: scfconv7
keywords: smallprint printgap noloewdin
keywords: NOSOSCF
formula: C25H31F6N3O3
InChI: InChI=1/C25H31F6N3O3/c1-13(2)11-17-12-18(9-10-19(17)23(37-8,24(26,27)28)25(29,30)31)34(21(35)14(3)4)22(36)20-15(5)32-33(7)16(20)6/h9-10,12-14H,11H2,1-8H3
68 atoms
F  -3.185011 -2.700655 0.192408
F  -5.006989 -1.63032 0.550618
F  -3.382874 -1.498042 1.954108
F  -4.825964 0.183121 -1.641088
F  -3.624227 -1.499543 -2.173487
F  -2.818214 0.496605 -2.310367
O  -3.422068 0.89875 0.427341
O  2.362736 -3.295268 0.374189
O  4.415909 -0.207578 1.175725
N  2.64238 -1.072183 0.049829
N  2.66695 2.996884 -1.384781
N  3.136814 3.539223 -0.251591
C  -3.074112 -0.336094 -0.097288
C  -1.543676 -0.470017 -0.022982
C  -0.777016 0.103776 1.009392
C  -1.259483 0.948184 2.168792
C  -1.260634 2.469506 1.935009
C  0.601042 -0.137493 1.003366
C  1.233679 -0.874944 0.021142
C  -0.895033 -1.257581 -0.979326
C  -3.677706 -1.554978 0.656161
C  -3.587703 -0.304495 -1.576215
C  0.469249 -1.448894 -0.981164
C  -1.801931 3.159537 3.181987
C  0.115871 3.012035 1.576689
C  3.115074 -2.395511 0.083427
C  4.525642 -2.669217 -0.397746
C  3.490627 -0.009879 0.413871
C  3.199131 1.303822 -0.130796
C  -4.635377 1.171603 1.122205
C  2.678293 1.659335 -1.372012
C  3.478981 2.533301 0.518523
C  4.419941 -3.485188 -1.68941
C  5.320723 -3.421182 0.663156
C  2.252248 0.861269 -2.547456
C  4.023936 2.764709 1.882767
C  2.254781 3.848499 -2.474994
H  -2.241953 0.643977 2.518451
H  -0.583402 0.750127 3.006754
H  -1.932122 2.693504 1.103699
H  1.188359 0.263882 1.820375
H  -1.43733 -1.752159 -1.769224
H  0.921871 -2.043412 -1.763032
H  -1.860773 4.24063 3.043056
H  -2.803663 2.806201 3.436205
H  -1.159654 2.975142 4.047176
H  0.084621 4.097051 1.45965
H  0.48427 2.599337 0.637387
H  0.851262 2.788127 2.353862
H  5.042528 -1.741724 -0.638979
H  -5.534798 0.911722 0.566214
H  -4.638178 2.249663 1.269514
H  -4.670415 0.700006 2.105508
H  3.947318 -4.452644 -1.519069
H  5.419091 -3.665442 -2.087595
H  3.852523 -2.958583 -2.459164
H  4.853562 -4.375492 0.909732
H  5.419264 -2.843089 1.581961
H  6.325097 -3.630294 0.293228
H  2.635561 1.292692 -3.473132
H  1.164643 0.820977 -2.630766
H  2.623864 -0.157978 -2.484737
H  3.511422 2.157508 2.629481
H  5.084498 2.517078 1.940683
H  3.907959 3.811292 2.160939
H  2.943897 3.772099 -3.316021
H  1.253055 3.587066 -2.81239
H  2.247809 4.87452 -2.119518
elementType: F O N C H
totalener: -1960.60825935 hartree
nucrepener: 4736.76950631 hartree
electener: -6697.37776566 hartree
twoeener: 5421.66866771 hartree
cpcmener: -0.03780405 hartree
kineticenergy: 1952.77379694 hartree
xcener: -178.388056906130 hartree
chargesum: 0.0000000
charge: -0.159674 -0.164189 -0.162097 -0.164650 -0.168138 -0.163264 -0.338246 -0.429035 -0.434993 0.042591 0.149739 -0.333521 0.096685 -0.012505 0.059684 -0.174112 0.079376 -0.265516 0.037355 -0.050621 0.494265 0.489522 -0.274098 -0.303724 -0.315924 0.271680 0.063073 0.290155 -0.031254 -0.132968 0.034108 -0.008769 -0.289172 -0.281342 -0.282247 -0.269833 -0.177691 0.098357 0.112606 0.051667 0.146067 0.149386 0.147240 0.092418 0.089851 0.086548 0.098208 0.085291 0.082107 0.054033 0.127066 0.118625 0.114426 0.094697 0.101463 0.100760 0.091462 0.095722 0.097570 0.128334 0.125606 0.106728 0.100746 0.111612 0.104736 0.127948 0.125694 0.112375
qa: -0.1597 -0.1642 -0.1621 -0.1647 -0.1681 -0.1633 -0.3382 -0.4290 -0.4350 0.0426 0.1497 -0.3335 0.0967 -0.0125 0.0597 -0.1741 0.0794 -0.2655 0.0374 -0.0506 0.4943 0.4895 -0.2741 -0.3037 -0.3159 0.2717 0.0631 0.2902 -0.0313 -0.1330 0.0341 -0.0088 -0.2892 -0.2813 -0.2822 -0.2698 -0.1777 0.0984 0.1126 0.0517 0.1461 0.1494 0.1472 0.0924 0.0899 0.0865 0.0982 0.0853 0.0821 0.0540 0.1271 0.1186 0.1144 0.0947 0.1015 0.1008 0.0915 0.0957 0.0976 0.1283 0.1256 0.1067 0.1007 0.1116 0.1047 0.1279 0.1257 0.1124
va: 1.1590 1.1448 1.1460 1.1432 1.1418 1.1491 1.9609 2.0763 2.0558 2.9456 3.3309 2.9039 4.1115 3.6260 3.6512 3.7789 3.7529 4.0761 3.7296 3.8941 4.4106 4.4871 4.0426 3.9284 3.9683 4.0858 3.8298 4.1165 3.3998 3.8632 3.8618 3.9899 3.9298 3.9224 3.9640 3.9421 3.8830 1.0165 1.0062 1.0350 0.9950 1.0233 1.0099 1.0052 1.0021 1.0025 1.0099 0.9899 1.0017 1.0355 0.9999 0.9861 0.9914 1.0139 1.0016 1.0026 1.0124 1.0158 1.0016 0.9976 0.9874 1.0070 0.9973 1.0018 1.0123 0.9863 0.9846 1.0127
dispcorr: -0.046616694 hartree
energy: -1960.654876043175
dipole: 55.90522 -56.53583 -0.63061 27.78173 -26.03113 1.75060 12.31974 -14.16506 -1.84532
magnitude: 2.62058 au
magnitude: 6.66100 debye
