program: Orca
programVersion: 5.0.2
elementType: F F F F F F O O O N N N C C C C C C C C C C C C C C C C C C C C C C C C C H H H H H H H H H H H H H H H H H H H H H H H H H H H H H H H
charge: 0
multiplicity: 1
keywords: wb97x-d3
keywords: def2-TZVPP
keywords: def2/J RIJCOSX
keywords: DEFGRID2
keywords: scfconv7
keywords: smallprint printgap noloewdin
keywords: NOSOSCF
formula: C25H31F6N3O3
InChI: InChI=1/C25H31F6N3O3/c1-13(2)11-17-12-18(9-10-19(17)23(37-8,24(26,27)28)25(29,30)31)34(21(35)14(3)4)22(36)20-15(5)32-33(7)16(20)6/h9-10,12-14H,11H2,1-8H3
68 atoms
F  -3.580239 -2.438363 0.950267
F  -4.645858 -0.731196 1.667086
F  -2.599084 -0.999612 2.224481
F  -5.070662 -0.780471 -1.121835
F  -3.331141 -1.882861 -1.724069
F  -3.528509 0.181747 -2.270553
O  -3.227881 1.043091 0.39004
O  2.420788 -2.689492 -2.234953
O  4.467076 0.434287 -1.058342
N  2.674176 -0.961338 -0.800789
N  2.208424 1.678509 2.582955
N  2.682792 2.764122 1.961155
C  -2.995833 -0.269131 -0.002479
C  -1.491521 -0.419432 -0.28169
C  -0.706381 0.614554 -0.816543
C  -1.111591 2.018257 -1.211608
C  -0.479839 3.102121 -0.3207
C  0.649215 0.357578 -1.030067
C  1.261937 -0.832072 -0.695843
C  -0.881853 -1.657926 -0.052478
C  -3.458212 -1.134444 1.217099
C  -3.747819 -0.698187 -1.293861
C  0.467243 -1.869036 -0.231952
C  -0.833583 4.483312 -0.859197
C  -0.85331 2.981991 1.151295
C  3.178707 -2.046602 -1.560121
C  4.637061 -2.437742 -1.379023
C  3.479209 0.139928 -0.428641
C  3.036523 0.929909 0.719154
C  -4.436403 1.747077 0.156624
C  2.393185 0.547557 1.886867
C  3.205293 2.333349 0.837341
C  4.967236 -3.651515 -2.239279
C  4.929723 -2.723477 0.097128
C  1.988985 -0.775887 2.425948
C  3.832118 3.278651 -0.125402
C  1.582192 1.811872 3.872188
H  -0.747869 2.175974 -2.232151
H  -2.183373 2.165734 -1.261646
H  0.608409 2.991167 -0.382754
H  1.247187 1.146912 -1.469524
H  -1.45178 -2.504088 0.295348
H  0.888342 -2.836019 0.003867
H  -0.351124 5.268762 -0.276359
H  -0.521595 4.604433 -1.8980
H  -1.911455 4.656879 -0.816544
H  -0.257353 3.678556 1.742391
H  -0.669549 1.978486 1.536214
H  -1.905533 3.213195 1.321325
H  5.265906 -1.607465 -1.698595
H  -5.32952 1.224095 0.493193
H  -4.560287 2.025801 -0.891798
H  -4.342713 2.66266 0.737033
H  6.02707 -3.887282 -2.138901
H  4.765909 -3.47059 -3.293582
H  4.397951 -4.531076 -1.939768
H  4.813834 -1.848525 0.735932
H  5.959594 -3.062085 0.208515
H  4.283339 -3.514996 0.481713
H  0.906443 -0.911888 2.394345
H  2.311257 -0.893804 3.462021
H  2.439015 -1.581417 1.852627
H  3.40035 3.184495 -1.122512
H  3.688475 4.301794 0.215537
H  4.899697 3.089847 -0.226314
H  1.483443 2.871734 4.082309
H  0.591619 1.3586 3.872229
H  2.182711 1.351271 4.657521
totalener: -1960.57827180 hartree
nucrepener: 4800.84402240 hartree
electener: -6761.42229421 hartree
twoeener: 5485.22414179 hartree
kineticenergy: 1952.84242366 hartree
xcener: -178.397247880235 hartree
chargesum: -0.0000000
charge: -0.163745 -0.162077 -0.159387 -0.161210 -0.148435 -0.159971 -0.318740 -0.323652 -0.345226 0.019555 0.153126 -0.289121 0.067581 0.050556 -0.015278 -0.195109 0.123487 -0.176390 0.020982 -0.090899 0.492104 0.498382 -0.164055 -0.285669 -0.274508 0.220883 0.048824 0.122551 0.074908 -0.139753 -0.034746 -0.018372 -0.257497 -0.298794 -0.268655 -0.240481 -0.200732 0.110294 0.076674 -0.006937 0.124345 0.129606 0.114049 0.091323 0.084892 0.077870 0.102151 0.058967 0.079886 0.086547 0.124893 0.105135 0.104877 0.082436 0.097968 0.084607 0.096299 0.097766 0.089054 0.122750 0.116102 0.090198 0.083054 0.103686 0.113873 0.121522 0.112500 0.123175
qa: -0.1637 -0.1621 -0.1594 -0.1612 -0.1484 -0.1600 -0.3187 -0.3237 -0.3452 0.0196 0.1531 -0.2891 0.0676 0.0506 -0.0153 -0.1951 0.1235 -0.1764 0.0210 -0.0909 0.4921 0.4984 -0.1641 -0.2857 -0.2745 0.2209 0.0488 0.1226 0.0749 -0.1398 -0.0347 -0.0184 -0.2575 -0.2988 -0.2687 -0.2405 -0.2007 0.1103 0.0767 -0.0069 0.1243 0.1296 0.1140 0.0913 0.0849 0.0779 0.1022 0.0590 0.0799 0.0865 0.1249 0.1051 0.1049 0.0824 0.0980 0.0846 0.0963 0.0978 0.0891 0.1228 0.1161 0.0902 0.0831 0.1037 0.1139 0.1215 0.1125 0.1232
va: 1.1479 1.1467 1.1513 1.1482 1.1761 1.1499 1.9681 2.1644 2.1292 2.9537 3.2898 2.8752 4.1312 3.5206 3.7483 3.8834 3.8015 4.0353 3.8424 3.9673 4.4753 4.4112 4.0290 3.9453 3.9366 4.1450 3.7626 4.1937 3.3480 3.8891 3.8958 3.9917 3.9653 3.9279 3.9597 3.9310 3.8911 1.0051 1.0285 1.0473 0.9988 1.0308 1.0208 1.0058 1.0061 1.0044 1.0084 1.0128 1.0194 1.0380 1.0006 0.9897 0.9900 1.0040 1.0115 1.0089 1.0033 1.0096 1.0020 0.9891 1.0015 1.0144 1.0022 1.0138 1.0037 1.0128 0.9824 0.9905
dispcorr: -0.049018464 hartree
energy: -1960.627290267473
dipole: 55.23975 -55.56301 -0.32326 28.17642 -27.72198 0.45444 7.83260 -6.29038 1.54222
magnitude: 1.63996 au
magnitude: 4.16843 debye
