program: Orca
programVersion: 5.0.2
elementType: F F F F F F O O O N N N C C C C C C C C C C C C C C C C C C C C C C C C C H H H H H H H H H H H H H H H H H H H H H H H H H H H H H H H
charge: 0
multiplicity: 1
keywords: wb97x-d3
keywords: def2-TZVPP
keywords: def2/J RIJCOSX
keywords: DEFGRID2
keywords: scfconv7
keywords: smallprint printgap noloewdin
keywords: NOSOSCF
formula: C25H31F6N3O3
InChI: InChI=1/C25H31F6N3O3/c1-13(2)11-17-12-18(9-10-19(17)23(37-8,24(26,27)28)25(29,30)31)34(21(35)14(3)4)22(36)20-15(5)32-33(7)16(20)6/h9-10,12-14H,11H2,1-8H3
68 atoms
F  -3.570796 -0.97726 -2.27259
F  -5.101092 -1.310882 -0.813006
F  -3.319634 -2.495548 -0.767169
F  -4.723954 1.381425 -0.81801
F  -2.721607 1.485484 -1.603961
F  -3.126238 2.116962 0.402626
O  -3.853867 -0.305353 1.194098
O  2.395358 -2.124085 2.122506
O  4.351167 -1.31362 -1.02769
N  2.597736 -0.765342 0.314618
N  2.198414 2.14079 -2.853694
N  2.661728 1.341484 -3.821943
C  -3.142559 -0.225897 0.00488
C  -1.618581 -0.378813 0.155954
C  -0.897841 0.110019 1.268928
C  -1.451545 0.854875 2.471651
C  -0.831072 0.497338 3.833072
C  0.487912 -0.032196 1.254841
C  1.183319 -0.649598 0.233207
C  -0.897324 -0.971109 -0.883625
C  -3.785471 -1.262962 -0.985938
C  -3.44006 1.209077 -0.516677
C  0.471966 -1.136096 -0.847545
C  -1.536688 1.299469 4.922088
C  -0.875831 -0.993396 4.145422
C  3.120664 -1.451009 1.440937
C  4.561411 -1.186471 1.839331
C  3.386092 -0.60877 -0.843372
C  2.965206 0.396795 -1.811847
C  -3.765719 -1.495609 1.956603
C  2.35409 1.627764 -1.624984
C  3.145966 0.285296 -3.214839
C  5.356128 -2.488437 1.861103
C  4.544477 -0.528368 3.222443
C  1.959675 2.376961 -0.404683
C  3.755585 -0.829935 -3.988378
C  1.629659 3.417955 -3.197818
H  -1.281391 1.923393 2.302232
H  -2.527472 0.750614 2.550867
H  0.218998 0.807523 3.842534
H  1.053405 0.36729 2.085657
H  -1.386797 -1.333238 -1.77204
H  0.968576 -1.635568 -1.667992
H  -2.59058 1.021456 4.994674
H  -1.082472 1.122599 5.89765
H  -1.493103 2.37227 4.726558
H  -0.407158 -1.197168 5.109004
H  -0.350595 -1.590309 3.399153
H  -1.905389 -1.351393 4.206578
H  5.03811 -0.49738 1.143836
H  -2.759876 -1.919678 1.960956
H  -4.472691 -2.253497 1.614151
H  -4.02866 -1.223977 2.977187
H  4.916734 -3.202769 2.55718
H  6.380061 -2.293788 2.181132
H  5.394996 -2.943732 0.873572
H  3.977907 0.405014 3.22557
H  5.563538 -0.290927 3.528558
H  4.110463 -1.189883 3.970823
H  2.435813 1.955822 0.476419
H  0.880133 2.346173 -0.244581
H  2.259126 3.424162 -0.469029
H  4.81954 -0.92193 -3.775989
H  3.300736 -1.788986 -3.739259
H  3.625505 -0.654201 -5.054082
H  1.563806 3.467544 -4.279748
H  0.63096 3.527774 -2.776847
H  2.253848 4.240256 -2.846263
totalener: -1960.58252278 hartree
nucrepener: 4724.28320949 hartree
electener: -6684.86573226 hartree
twoeener: 5408.47976225 hartree
kineticenergy: 1952.84874442 hartree
xcener: -178.397408317471 hartree
chargesum: 0.0000000
charge: -0.163763 -0.150188 -0.164948 -0.152213 -0.162717 -0.162352 -0.317620 -0.333231 -0.358259 0.011958 0.139751 -0.303839 0.225501 -0.125055 0.055773 -0.291488 0.113059 -0.262515 0.089926 -0.030154 0.506879 0.483677 -0.237576 -0.273149 -0.307610 0.216416 0.054464 0.261341 -0.142335 -0.159676 0.048048 0.080670 -0.274586 -0.267233 -0.274566 -0.238897 -0.186263 0.103666 0.119126 0.031527 0.112125 0.120244 0.113701 0.079414 0.088137 0.083734 0.093472 0.117558 0.071078 0.048931 0.121443 0.116969 0.113364 0.096541 0.081747 0.104822 0.077051 0.090461 0.103041 0.093601 0.120566 0.115121 0.104332 0.086961 0.100577 0.118421 0.115868 0.109173
qa: -0.1638 -0.1502 -0.1649 -0.1522 -0.1627 -0.1624 -0.3176 -0.3332 -0.3583 0.0120 0.1398 -0.3038 0.2255 -0.1251 0.0558 -0.2915 0.1131 -0.2625 0.0899 -0.0302 0.5069 0.4837 -0.2376 -0.2731 -0.3076 0.2164 0.0545 0.2613 -0.1423 -0.1597 0.0480 0.0807 -0.2746 -0.2672 -0.2746 -0.2389 -0.1863 0.1037 0.1191 0.0315 0.1121 0.1202 0.1137 0.0794 0.0881 0.0837 0.0935 0.1176 0.0711 0.0489 0.1214 0.1170 0.1134 0.0965 0.0817 0.1048 0.0771 0.0905 0.1030 0.0936 0.1206 0.1151 0.1043 0.0870 0.1006 0.1184 0.1159 0.1092
va: 1.1505 1.1749 1.1392 1.1732 1.1487 1.1528 1.9871 2.1656 2.1272 2.9519 3.3062 2.9219 4.0527 3.7735 3.6867 3.8057 3.7726 3.9337 3.7867 3.9541 4.4434 4.4728 4.1464 3.9371 3.9308 4.1170 3.8658 4.1279 3.5487 3.9045 3.8573 3.9797 3.9263 3.9265 3.9833 3.9460 3.8959 1.0057 1.0197 1.0141 1.0117 1.0411 1.0217 1.0066 1.0068 1.0067 1.0127 1.0062 1.0069 1.0347 0.9786 1.0035 0.9878 1.0116 1.0034 1.0179 1.0072 1.0048 1.0145 1.0124 0.9875 0.9994 1.0030 1.0007 1.0144 1.0162 0.9852 0.9869
dispcorr: -0.044757953 hartree
energy: -1960.627280728546
dipole: 55.78338 -55.59629 0.18709 3.00239 -1.68208 1.32032 40.28891 -39.46225 0.82665
magnitude: 1.56895 au
magnitude: 3.98794 debye
