program: Orca
programVersion: 5.0.2
elementType: F F F F F F O O O N N N C C C C C C C C C C C C C C C C C C C C C C C C C H H H H H H H H H H H H H H H H H H H H H H H H H H H H H H H
charge: 0
multiplicity: 1
keywords: wb97x-d3
keywords: def2-TZVPP
keywords: def2/J RIJCOSX
keywords: DEFGRID2
keywords: scfconv7
keywords: smallprint printgap noloewdin
keywords: NOSOSCF
formula: C25H31F6N3O3
InChI: InChI=1/C25H31F6N3O3/c1-13(2)11-17-12-18(9-10-19(17)23(37-8,24(26,27)28)25(29,30)31)34(21(35)14(3)4)22(36)20-15(5)32-33(7)16(20)6/h9-10,12-14H,11H2,1-8H3
68 atoms
F  -3.667712 -1.115934 -2.127932
F  -5.064619 -1.61768 -0.58763
F  -3.179312 -2.629607 -0.678878
F  -2.97837 1.39584 -1.430233
F  -3.323284 1.937677 0.617566
F  -4.916351 1.101722 -0.544426
O  -3.777578 -0.550673 1.374613
O  2.361282 -2.618368 1.745236
O  4.065463 -1.444016 -1.520616
N  2.572177 -1.018125 0.152659
N  2.775671 2.317283 -2.931836
N  2.675802 2.869518 -1.718155
C  -3.159333 -0.380032 0.14437
C  -1.622306 -0.439291 0.190727
C  -0.858993 -0.120043 1.333002
C  -1.360636 0.442067 2.65237
C  -0.570727 1.65053 3.183166
C  0.516225 -0.350165 1.281826
C  1.168244 -0.797632 0.149301
C  -0.942415 -0.847154 -0.959338
C  -3.771743 -1.444874 -0.836484
C  -3.607335 1.033799 -0.313992
C  0.422317 -1.030858 -0.992485
C  -0.67682 2.861412 2.263969
C  -1.051285 1.995963 4.588347
C  3.097696 -1.937006 1.082799
C  4.597782 -1.928689 1.32191
C  3.289087 -0.668749 -1.013093
C  3.014721 0.661017 -1.547203
C  -3.566037 -1.753396 2.094978
C  2.999242 0.996547 -2.892263
C  2.807049 1.885558 -0.860227
C  5.183378 -3.309567 1.044106
C  4.835919 -1.505947 2.773491
C  3.132503 0.171385 -4.119819
C  2.794094 2.16126 0.602464
C  2.619621 3.137259 -4.104592
H  -2.405472 0.729398 2.603238
H  -1.301203 -0.356366 3.400628
H  0.487311 1.383148 3.267297
H  1.102318 -0.170185 2.172283
H  -1.469562 -1.050013 -1.876719
H  0.888396 -1.382339 -1.903226
H  -0.02084 3.663102 2.605954
H  -0.399616 2.625654 1.235767
H  -1.693581 3.255353 2.250008
H  -0.496392 2.842367 4.995176
H  -0.923709 1.157559 5.275144
H  -2.109044 2.267377 4.587218
H  5.095059 -1.204479 0.6779
H  -3.749215 -1.517551 3.141382
H  -2.54756 -2.134626 2.000085
H  -4.266473 -2.534331 1.792707
H  6.252614 -3.311423 1.256559
H  5.048941 -3.592443 0.001414
H  4.713928 -4.066255 1.672182
H  4.425121 -0.516242 2.98083
H  5.906499 -1.463619 2.973972
H  4.387283 -2.211699 3.470902
H  3.998484 0.474275 -4.711277
H  2.252157 0.259121 -4.759316
H  3.26959 -0.875403 -3.867022
H  3.594569 1.632662 1.119807
H  2.919038 3.227916 0.77659
H  1.851577 1.858526 1.057901
H  2.538252 4.16894 -3.77847
H  3.479314 3.041564 -4.76716
H  1.718733 2.870495 -4.657759
totalener: -1960.58265249 hartree
nucrepener: 4709.69306389 hartree
electener: -6670.27571638 hartree
twoeener: 5394.39706541 hartree
kineticenergy: 1952.85364291 hartree
xcener: -178.396839055388 hartree
chargesum: 0.0000000
charge: -0.165188 -0.151234 -0.161756 -0.160115 -0.159271 -0.154096 -0.322552 -0.337917 -0.343275 0.032384 0.134775 -0.312572 0.213727 -0.033968 -0.044258 -0.268236 0.087508 -0.165565 0.047959 -0.073982 0.502559 0.477387 -0.207766 -0.305149 -0.275049 0.214641 0.036130 0.164851 -0.053027 -0.157817 -0.004612 0.141576 -0.270359 -0.264988 -0.255180 -0.252734 -0.181684 0.107632 0.099570 0.025055 0.131523 0.131184 0.124731 0.097703 0.094361 0.087369 0.086606 0.082992 0.082796 0.049286 0.117061 0.121908 0.115124 0.081875 0.102161 0.098094 0.078870 0.089291 0.103473 0.108789 0.099934 0.109494 0.101171 0.113661 0.046106 0.118964 0.107477 0.114587
qa: -0.1652 -0.1512 -0.1618 -0.1601 -0.1593 -0.1541 -0.3226 -0.3379 -0.3433 0.0324 0.1348 -0.3126 0.2137 -0.0340 -0.0443 -0.2682 0.0875 -0.1656 0.0480 -0.0740 0.5026 0.4774 -0.2078 -0.3051 -0.2750 0.2146 0.0361 0.1649 -0.0530 -0.1578 -0.0046 0.1416 -0.2704 -0.2650 -0.2552 -0.2527 -0.1817 0.1076 0.0996 0.0251 0.1315 0.1312 0.1247 0.0977 0.0944 0.0874 0.0866 0.0830 0.0828 0.0493 0.1171 0.1219 0.1151 0.0819 0.1022 0.0981 0.0789 0.0893 0.1035 0.1088 0.0999 0.1095 0.1012 0.1137 0.0461 0.1190 0.1075 0.1146
va: 1.1462 1.1721 1.1437 1.1522 1.1536 1.1690 1.9850 2.1708 2.1258 2.9287 3.3181 2.9423 4.0570 3.7436 3.6224 3.8247 3.8151 3.9637 3.9476 3.9797 4.4352 4.4764 4.0803 3.9293 3.9446 4.1417 3.8766 4.1920 3.4871 3.9023 3.9349 3.8771 3.9271 3.9313 3.9536 3.9648 3.8943 1.0302 0.9976 1.0208 1.0048 1.0361 1.0074 1.0052 1.0026 1.0146 1.0065 1.0065 1.0056 1.0316 0.9872 0.9825 1.0017 1.0036 1.0165 1.0123 1.0065 1.0048 1.0150 0.9979 0.9928 1.0195 0.9997 1.0208 0.9980 1.0158 0.9877 0.9865
dispcorr: -0.044571546 hartree
energy: -1960.627224040091
dipole: 61.87312 -61.06120 0.81191 10.12114 -9.45308 0.66806 28.62515 -29.12828 -0.50314
magnitude: 1.16561 au
magnitude: 2.96275 debye
