program: Orca
programVersion: 5.0.2
elementType: F F F F F F O O O N N N C C C C C C C C C C C C C C C C C C C C C C C C C H H H H H H H H H H H H H H H H H H H H H H H H H H H H H H H
charge: 0
multiplicity: 1
keywords: wb97x-d3
keywords: def2-TZVPP
keywords: def2/J RIJCOSX
keywords: DEFGRID2
keywords: scfconv7
keywords: smallprint printgap noloewdin
keywords: NOSOSCF
formula: C25H31F6N3O3
InChI: InChI=1/C25H31F6N3O3/c1-13(2)11-17-12-18(9-10-19(17)23(37-8,24(26,27)28)25(29,30)31)34(21(35)14(3)4)22(36)20-15(5)32-33(7)16(20)6/h9-10,12-14H,11H2,1-8H3
68 atoms
F  -3.233893 -0.307326 -1.737331
F  -2.536457 1.649215 -1.22285
F  -4.619736 1.153366 -1.002976
F  -4.8887 1.275944 1.708456
F  -3.224191 2.531401 1.225114
F  -3.063944 1.083847 2.810915
O  -3.920584 -0.90679 0.746713
O  2.510345 -2.495773 1.953274
O  4.489191 0.558468 1.159246
N  2.617154 -0.624165 0.66407
N  2.286842 2.727561 -2.062394
N  2.979162 3.592951 -1.311635
C  -3.089155 0.191393 0.58206
C  -1.586676 -0.117345 0.670039
C  -1.019662 -1.335281 0.230921
C  -1.780951 -2.570993 -0.221568
C  -1.151785 -3.424082 -1.332165
C  0.367448 -1.452505 0.263146
C  1.210701 -0.449487 0.713166
C  -0.724918 0.880616 1.125763
C  -3.382779 0.684953 -0.863994
C  -3.56613 1.294101 1.591883
C  0.643957 0.722074 1.180286
C  -2.043044 -4.637731 -1.580776
C  -0.947574 -2.642783 -2.624015
C  3.16052 -1.818979 1.204881
C  4.49991 -2.288759 0.665889
C  3.473873 0.487332 0.504975
C  3.085652 1.531249 -0.434179
C  -3.870113 -1.618125 1.970698
C  2.315357 1.47498 -1.588314
C  3.482347 2.891275 -0.32567
C  4.23532 -3.554387 -0.155521
C  5.474719 -2.559159 1.805537
C  1.630961 0.359154 -2.288177
C  4.31607 3.541667 0.720801
C  1.635835 3.19297 -3.259776
H  -1.898561 -3.212233 0.659532
H  -2.787622 -2.327625 -0.540655
H  -0.181514 -3.807877 -1.001133
H  0.809122 -2.372816 -0.090358
H  -1.095764 1.835081 1.459931
H  1.250361 1.5255 1.573764
H  -2.174893 -5.232593 -0.675651
H  -3.033945 -4.332946 -1.924357
H  -1.617168 -5.289547 -2.344342
H  -0.477943 -3.266311 -3.386057
H  -0.313605 -1.768073 -2.479226
H  -1.900184 -2.295345 -3.026234
H  4.937065 -1.545521 0.000463
H  -4.515561 -1.170433 2.728855
H  -2.857094 -1.699402 2.370896
H  -4.239855 -2.618943 1.757296
H  5.168407 -3.914735 -0.589155
H  3.54466 -3.367796 -0.980638
H  3.81919 -4.349063 0.462595
H  5.687269 -1.649049 2.363338
H  6.416874 -2.937945 1.408797
H  5.076836 -3.303405 2.49491
H  2.035972 -0.600417 -1.979541
H  1.75116 0.432969 -3.369778
H  0.560653 0.353189 -2.070192
H  5.343673 3.183111 0.687593
H  4.315999 4.619454 0.572123
H  3.94224 3.330928 1.722814
H  2.130523 2.815994 -4.155671
H  0.590203 2.888743 -3.278709
H  1.68826 4.276794 -3.261514
totalener: -1960.58219256 hartree
nucrepener: 4737.50952235 hartree
electener: -6698.09171491 hartree
twoeener: 5421.55583804 hartree
kineticenergy: 1952.86151082 hartree
xcener: -178.401133310065 hartree
chargesum: 0.0000000
charge: -0.162899 -0.164410 -0.151778 -0.150893 -0.163802 -0.164345 -0.321216 -0.319965 -0.357302 0.022554 0.141965 -0.305186 0.237706 -0.121433 -0.009648 -0.282250 0.093976 -0.152566 0.055986 -0.037254 0.483305 0.510931 -0.222721 -0.281090 -0.255888 0.193084 0.054515 0.264076 -0.160042 -0.158396 0.074223 0.087822 -0.274283 -0.269673 -0.319676 -0.236369 -0.187247 0.093143 0.109330 0.034292 0.115544 0.121055 0.114172 0.083180 0.083855 0.086854 0.093494 0.047350 0.085208 0.049128 0.114930 0.118152 0.119365 0.092991 0.076692 0.104899 0.105114 0.081687 0.095931 0.104239 0.117600 0.125715 0.102140 0.099750 0.088452 0.110832 0.116461 0.118634
qa: -0.1629 -0.1644 -0.1518 -0.1509 -0.1638 -0.1643 -0.3212 -0.3200 -0.3573 0.0226 0.1420 -0.3052 0.2377 -0.1214 -0.0096 -0.2822 0.0940 -0.1526 0.0560 -0.0373 0.4833 0.5109 -0.2227 -0.2811 -0.2559 0.1931 0.0545 0.2641 -0.1600 -0.1584 0.0742 0.0878 -0.2743 -0.2697 -0.3197 -0.2364 -0.1872 0.0931 0.1093 0.0343 0.1155 0.1211 0.1142 0.0832 0.0839 0.0869 0.0935 0.0474 0.0852 0.0491 0.1149 0.1182 0.1194 0.0930 0.0767 0.1049 0.1051 0.0817 0.0959 0.1042 0.1176 0.1257 0.1021 0.0997 0.0885 0.1108 0.1165 0.1186
va: 1.1470 1.1442 1.1728 1.1740 1.1495 1.1415 1.9891 2.1762 2.1276 2.9735 3.3074 2.9178 4.0579 3.7645 3.7257 3.8324 3.8475 3.9688 3.8336 3.9612 4.4557 4.4366 4.1006 3.9430 3.9303 4.1500 3.8609 4.1168 3.5492 3.9081 3.8255 3.9732 3.9264 3.9250 3.9761 3.9456 3.8956 0.9976 1.0262 1.0160 1.0067 1.0411 1.0242 1.0069 1.0054 1.0066 1.0087 1.0138 1.0154 1.0326 1.0019 0.9826 0.9866 1.0056 1.0061 1.0132 1.0164 1.0031 1.0129 1.0056 1.0010 0.9789 1.0032 1.0144 1.0013 0.9863 0.9851 1.0159
dispcorr: -0.044903206 hartree
energy: -1960.627095767808
dipole: 51.00304 -51.20115 -0.19812 -40.60839 39.87695 -0.73144 -16.69106 15.36952 -1.32154
magnitude: 1.52339 au
magnitude: 3.87216 debye
