program: Orca
programVersion: 5.0.2
elementType: F F F O O O O N C C C C C C C C C C C C C C C C C C C C C C C C H H H H H H H H H H H H H H H H H H H H H H H H
charge: 0
multiplicity: 1
keywords: wb97x-d3
keywords: def2-TZVPP
keywords: def2/J RIJCOSX
keywords: DEFGRID2
keywords: scfconv7
keywords: smallprint printgap noloewdin
keywords: NOSOSCF
formula: C24H24F3NO4
InChI: InChI=1/C24H24F3NO4/c1-22(2,3)16-9-11-17(12-10-16)23(15-28,21(30)32-14-13-31-4)20(29)18-7-5-6-8-19(18)24(25,26)27/h5-12H,13-14H2,1-4H3
56 atoms
F  -3.300253 -0.646268 0.294953
F  -3.978478 1.332077 -0.21803
F  -4.804518 0.320141 1.484636
O  0.183294 -1.177811 -2.29291
O  -1.171043 0.947814 -1.035757
O  -1.032895 -2.703465 -1.180446
O  -2.511092 -0.997069 -3.218262
N  -0.840446 -2.27624 2.083453
C  5.704397 0.346794 0.352667
C  4.220171 0.011355 0.298493
C  6.306863 0.152364 -1.044287
C  5.881187 1.806735 0.78674
C  6.462276 -0.541852 1.336373
C  -0.031965 -0.884141 0.027762
C  1.46006 -0.555528 0.132157
C  3.650976 -1.033566 1.0179
C  3.366655 0.764381 -0.511302
C  2.293062 -1.314736 0.939631
C  2.013591 0.493807 -0.598355
C  -0.864611 0.429995 0.001399
C  -0.360003 -1.709399 -1.229476
C  -1.253543 1.007246 1.322566
C  -0.477727 -1.668899 1.17726
C  -2.599066 1.110809 1.68854
C  -0.267996 1.478998 2.179841
C  -2.940419 1.707401 2.892366
C  -3.674505 0.536591 0.814052
C  -0.244132 -1.610138 -3.598727
C  -0.618717 2.080544 3.379485
C  -1.951705 2.199659 3.73162
C  -1.408279 -0.771873 -4.060779
C  -3.589191 -0.128055 -3.480024
H  7.372165 0.391253 -1.033703
H  6.200154 -0.880821 -1.379885
H  5.833117 0.795988 -1.78679
H  5.414212 2.503787 0.090098
H  6.942367 2.058491 0.836715
H  5.450779 1.981714 1.774335
H  6.087744 -0.437576 2.356344
H  7.51616 -0.260095 1.345678
H  6.411656 -1.597421 1.06358
H  4.256995 -1.654803 1.662264
H  3.757826 1.588622 -1.09404
H  1.904712 -2.141144 1.52053
H  1.40871 1.117735 -1.241314
H  0.776062 1.397476 1.910177
H  -3.975017 1.790806 3.193893
H  -0.477594 -2.674665 -3.598109
H  0.607339 -1.444329 -4.255266
H  0.155458 2.453256 4.035638
H  -2.230038 2.666202 4.666317
H  -1.123938 0.288556 -4.068389
H  -1.629887 -1.050789 -5.099968
H  -3.312699 0.923511 -3.347033
H  -3.973073 -0.250193 -4.498567
H  -4.389849 -0.369326 -2.782567
elementType: F O N C H
totalener: -1584.34612015 hartree
nucrepener: 3454.84519833 hartree
electener: -5039.19131849 hartree
oneelecener: -9041.69673954 hartree
twoeener: 4002.50542105 hartree
cpcmener: -0.04983497 hartree
kineticenergy: 1577.91077727 hartree
xcener: -146.964011259989 hartree
chargesum: -0.0000000
charge: -0.182396 -0.177037 -0.171808 -0.253393 -0.332477 -0.417579 -0.383378 -0.049371 0.330219 -0.111137 -0.330073 -0.331305 -0.359415 0.800987 -0.284498 -0.136600 -0.162314 -0.140072 -0.180088 0.213024 0.358360 0.023501 -0.361621 -0.212062 -0.170453 -0.063154 0.563151 0.003811 -0.116288 -0.149374 0.009737 -0.124524 0.098237 0.104240 0.099369 0.099000 0.097874 0.103983 0.104569 0.101167 0.100891 0.148615 0.147191 0.137657 0.150318 0.161851 0.150239 0.110975 0.121460 0.166098 0.167580 0.098519 0.108428 0.096234 0.110110 0.113022
qa: -0.1824 -0.1770 -0.1718 -0.2534 -0.3325 -0.4176 -0.3834 -0.0494 0.3302 -0.1111 -0.3301 -0.3313 -0.3594 0.8010 -0.2845 -0.1366 -0.1623 -0.1401 -0.1801 0.2130 0.3584 0.0235 -0.3616 -0.2121 -0.1705 -0.0632 0.5632 0.0038 -0.1163 -0.1494 0.0097 -0.1245 0.0982 0.1042 0.0994 0.0990 0.0979 0.1040 0.1046 0.1012 0.1009 0.1486 0.1472 0.1377 0.1503 0.1619 0.1502 0.1110 0.1215 0.1661 0.1676 0.0985 0.1084 0.0962 0.1101 0.1130
va: 1.1101 1.1208 1.1365 2.1977 2.1156 2.0746 1.9066 3.1081 3.6436 3.8012 3.9187 3.9181 3.9264 3.1917 3.8455 3.9213 4.0262 3.9964 3.9844 3.8308 4.2609 3.4785 4.0939 3.8928 3.9241 3.8885 4.4045 3.8407 3.9259 3.9172 3.9186 3.8893 1.0031 1.0030 1.0034 1.0039 1.0031 1.0031 1.0002 1.0065 1.0005 0.9977 1.0014 1.0127 1.0161 0.9963 1.0057 1.0177 1.0021 0.9890 0.9872 0.9970 1.0037 0.9926 0.9925 0.9959
dispcorr: -0.033457667 hartree
energy: -1584.379577821529
dipole: 57.57887 -54.73999 2.83887 6.69822 -3.93994 2.75828 -11.39352 10.91693 -0.47659
magnitude: 3.98678 au
magnitude: 10.13360 debye
