program: Orca
programVersion: 5.0.2
elementType: F F F O O O O N C C C C C C C C C C C C C C C C C C C C C C C C H H H H H H H H H H H H H H H H H H H H H H H H
charge: 0
multiplicity: 1
keywords: wb97x-d3
keywords: def2-TZVPP
keywords: def2/J RIJCOSX
keywords: DEFGRID2
keywords: scfconv7
keywords: smallprint printgap noloewdin
keywords: NOSOSCF
formula: C24H24F3NO4
InChI: InChI=1/C24H24F3NO4/c1-22(2,3)16-9-11-17(12-10-16)23(15-28,21(30)32-14-13-31-4)20(29)18-7-5-6-8-19(18)24(25,26)27/h5-12H,13-14H2,1-4H3
56 atoms
F  -3.689377 0.650481 0.045966
F  -3.890637 2.746421 0.483904
F  -5.177881 1.322001 1.446023
O  -0.798943 -1.760935 -1.871736
O  -0.924721 2.097445 -0.228573
O  -1.541348 0.313202 -2.290077
O  1.495735 -2.167296 -3.353117
N  -1.76645 -2.164872 1.307914
C  5.228566 -0.468528 -0.103104
C  3.706532 -0.437119 -0.055505
C  5.681533 -0.925023 -1.495256
C  5.768836 0.940575 0.167719
C  5.819968 -1.423905 0.930918
C  -0.643866 -0.274483 -0.096807
C  0.888485 -0.343083 -0.053846
C  2.957151 -1.182726 0.847848
C  3.002488 0.370029 -0.953509
C  1.567094 -1.13845 0.854254
C  1.621892 0.422562 -0.958033
C  -1.074658 1.111982 0.436768
C  -1.071356 -0.515093 -1.563961
C  -1.580226 1.174808 1.844368
C  -1.25285 -1.336006 0.698157
C  -2.927415 1.385631 2.142994
C  -0.655461 1.055633 2.873473
C  -3.334683 1.475183 3.465697
C  -3.928244 1.528751 1.037577
C  -0.872312 -2.184264 -3.247686
C  -1.068254 1.153143 4.194066
C  -2.405045 1.35995 4.488987
C  0.338452 -1.720024 -4.016642
C  2.677929 -1.706077 -3.964933
H  5.323998 -1.932223 -1.717295
H  5.32491 -0.261284 -2.284044
H  6.772015 -0.939828 -1.548847
H  6.860075 0.939748 0.12833
H  5.471003 1.296786 1.155551
H  5.416505 1.664177 -0.568578
H  5.490205 -2.452737 0.775061
H  5.56394 -1.137748 1.952596
H  6.90846 -1.416221 0.854871
H  3.442692 -1.823373 1.57083
H  3.536652 0.973407 -1.676693
H  1.033545 -1.742477 1.577134
H  1.132029 1.058864 -1.683974
H  0.390788 0.895887 2.647328
H  -4.374758 1.633396 3.715087
H  -1.788018 -1.828674 -3.719861
H  -0.912176 -3.270218 -3.193962
H  -0.34025 1.065533 4.988973
H  -2.732329 1.430579 5.517003
H  0.263212 -2.135892 -5.030899
H  0.343429 -0.627349 -4.121994
H  2.730396 -0.611438 -3.984821
H  3.522351 -2.083224 -3.389039
H  2.774433 -2.067984 -4.995034
elementType: F O N C H
totalener: -1584.34538289 hartree
nucrepener: 3439.37177854 hartree
electener: -5023.71716142 hartree
oneelecener: -9010.18397448 hartree
twoeener: 3986.46681306 hartree
cpcmener: -0.04878041 hartree
kineticenergy: 1577.88328472 hartree
xcener: -146.958168115052 hartree
chargesum: -0.0000000
charge: -0.178368 -0.172555 -0.170185 -0.268386 -0.338387 -0.397505 -0.390193 -0.053594 0.366760 -0.086811 -0.367310 -0.331309 -0.361751 0.782213 -0.160061 -0.121070 -0.217223 -0.185765 -0.296369 0.293484 0.354740 0.042987 -0.428903 -0.172617 -0.146421 -0.081350 0.542448 0.002509 -0.145191 -0.139500 0.004883 -0.127746 0.107457 0.102262 0.106374 0.098962 0.103421 0.098977 0.103141 0.102569 0.101473 0.149151 0.151037 0.137729 0.145764 0.170082 0.151155 0.113245 0.119056 0.165316 0.167865 0.116755 0.104699 0.095281 0.123348 0.113431
qa: -0.1784 -0.1726 -0.1702 -0.2684 -0.3384 -0.3975 -0.3902 -0.0536 0.3668 -0.0868 -0.3673 -0.3313 -0.3618 0.7822 -0.1601 -0.1211 -0.2172 -0.1858 -0.2964 0.2935 0.3547 0.0430 -0.4289 -0.1726 -0.1464 -0.0814 0.5424 0.0025 -0.1452 -0.1395 0.0049 -0.1277 0.1075 0.1023 0.1064 0.0990 0.1034 0.0990 0.1031 0.1026 0.1015 0.1492 0.1510 0.1377 0.1458 0.1701 0.1512 0.1132 0.1191 0.1653 0.1679 0.1168 0.1047 0.0953 0.1233 0.1134
va: 1.1157 1.1240 1.1392 2.1823 2.1169 2.1045 1.8875 3.1109 3.5872 3.7643 3.9342 3.9190 3.9283 3.1811 3.6702 3.9378 4.0179 3.9687 4.0694 3.8114 4.2581 3.5485 4.1944 3.8574 3.9248 3.8987 4.4441 3.8933 3.9417 3.9030 3.8742 3.8960 0.9974 0.9991 1.0074 1.0028 1.0035 1.0031 1.0003 1.0005 1.0064 0.9968 0.9994 1.0184 1.0277 0.9848 1.0049 1.0107 1.0017 0.9888 0.9868 1.0022 0.9986 0.9889 0.9864 0.9930
dispcorr: -0.034670864 hartree
energy: -1584.380053750096
dipole: 70.59254 -67.82386 2.76868 -17.01546 16.56673 -0.44873 -14.54511 14.93872 0.39361
magnitude: 2.83229 au
magnitude: 7.19911 debye
